{"text_format":"1","workbook":"xlsx","n_sheets":11,"sheets":["Score Summary","Battle Score List","Instructions","Captain","Master Sheet","03_24_03_LA","03_24_02_LA","03_24_01_LA","03_23_03_LA","03_23_02_LA","03_23_01_LA"],"not_rendered":{"charts":0,"images":0,"macros":1,"external_links":0,"defined_names":77,"comments":0,"pivot_tables":1},"unopened":[],"bounds":{"document_bytes":16777216,"sheet_cells":100000,"rows_first":2000,"rows_last":500,"rows_between":2000,"halvings":0,"cell_chars":16384,"cell_head_chars":4096},"cells_cut":0,"cells_raw":0,"read":"whole","date_system":"1900"}

{"sheet":"Score Summary","index":0,"n_rows":17,"n_cols":8,"rows_kept":17,"cut":false,"hidden":false,"merged":[]}
["Row Labels","Sum of 1232.666667",null,null,null,"Captain","Score","Class"]
["H Ted Buehring",4210.4361259655379,null,null,null,"Tyler Helland",6068.2361768825458,6]
["Peter Ellison",6731.4636015325668,null,null,null,"Michael Tanzillo",5434.3591083246265,6]
["David Haynes",3091.0428422152563,null,null,null,"Kevin Plumer",8933.5910012907989,5]
["Tyler Helland",6068.2361768825458,null,null,null,"Erik Helland",8733.5910012907989,5]
["Tom Palmer",7594.0637709362418,null,null,null,"Tom Palmer",7594.0637709362418,4]
["Kevin Plumer",8933.5910012907989,null,null,null,"Peter Ellison",6731.4636015325668,4]
["Gerald Roberts",4773.8823529411766,null,null,null,"John Zaruba",5045.2556081727034,4]
["Glenn Brandon Smith",4204.8794326241132,null,null,null,"Gerald Roberts",4773.8823529411766,4]
["Randy Stiponovich",4791.0713391739673,null,null,null,"H Ted Buehring",4210.4361259655379,4]
["Michael Tanzillo",5434.3591083246265,null,null,null,"Glenn Brandon Smith",4204.8794326241132,4]
["Rick Whitsell",5198.597701149426,null,null,null,"David Haynes",3091.0428422152563,4]
["Erik Helland",8733.5910012907989,null,null,null,"Gary Powell",5259.5299375002451,3]
["Gary Powell",5259.5299375002451,null,null,null,"Rick Whitsell",5198.597701149426,2]
["John Zaruba",5045.2556081727034,null,null,null,"Randy Stiponovich",4791.0713391739673,2]
["(blank)"]
["Grand Total",80070.000000000015]

{"sheet":"Battle Score List","index":1,"n_rows":500,"n_cols":7,"rows_kept":500,"cut":false,"hidden":false,"merged":[]}
["Battle Number","Member","Score","Battle Location","Battle Date","Battle Time","Battle ID"]
[1,"Will Cover",530,"MI","8_11","AM",{"$f":"CONCATENATE(D2,\"_\",E2,\"_\",F2)","v":"MI_8_11_AM"}]
[{"$f":"A2","v":1},"Mark Roe",730,"MI",{"$f":"E2","v":"8_11"},"AM",{"$f":"CONCATENATE(D3,\"_\",E3,\"_\",F3)","v":"MI_8_11_AM"}]
[{"$f":"A3","v":1},"Christopher Gaigalas",2028.75,"MI",{"$f":"E3","v":"8_11"},"AM","MI_8_11_AM"]
[1,"Kas Gaigalas",3381.25,"MI","8_11","AM","MI_8_11_AM"]
[2,"Mark Roe",635,"MI","8_11","PM","MI_8_11_PM"]
[2,"Will Cover",635,"MI","8_11","PM","MI_8_11_PM"]
[2,"Kas Gaigalas",3400,"MI","8_11","PM","MI_8_11_PM"]
[3,"Mike Mangus",609.56521739130437,"GA","9_01","AM","GA_9_01_AM"]
[{"$f":"A9","v":3},"Wes Hawkins",809.56521739130437,"GA",{"$f":"E9","v":"9_01"},"AM","GA_9_01_AM"]
[{"$f":"A10","v":3},"Christopher Koehler",1040.8695652173913,"GA",{"$f":"E10","v":"9_01"},"AM","GA_9_01_AM"]
[3,"John Jones",564.61538461538464,"GA","9_01","AM","GA_9_01_AM"]
[3,"Kevin Plumer",1220.3846153846152,"GA","9_01","AM","GA_9_01_AM"]
[3,"Philip Pace",564.61538461538464,"GA","9_01","AM","GA_9_01_AM"]
[3,"Brian Koehler",1270.3846153846152,"GA","9_01","AM","GA_9_01_AM"]
[4,"Brian Koehler",2244.705882352941,"GA","9_01","PM","GA_9_01_PM"]
[4,"Mike Mangus",271.47058823529409,"GA","9_01","PM","GA_9_01_PM"]
[4,"Wes Hawkins",1745.8823529411764,"GA","9_01","PM","GA_9_01_PM"]
[4,"Sara Carter",2244.705882352941,"GA","9_01","PM","GA_9_01_PM"]
[4,"Christopher Koehler",406.17647058823525,"GA","9_01","PM","GA_9_01_PM"]
[4,"Phil Koehler",338.82352941176475,"GA","9_01","PM","GA_9_01_PM"]
[4,"John Jones",269.41176470588238,"GA","9_01","PM","GA_9_01_PM"]
[4,"Kevin Plumer",2244.705882352941,"GA","9_01","PM","GA_9_01_PM"]
[4,"William Brown",204.11764705882354,"GA","9_01","PM",{"$f":"CONCATENATE(D24,\"_\",E24,\"_\",F24)","v":"GA_9_01_PM"}]
[5,"Pete Demetri",1350,"GA","9_02","AM",{"$f":"CONCATENATE(D25,\"_\",E25,\"_\",F25)","v":"GA_9_02_AM"}]
[{"$f":"A25","v":5},"Sara Carter",671.14285714285711,"GA",{"$f":"E25","v":"9_02"},"AM",{"$f":"CONCATENATE(D26,\"_\",E26,\"_\",F26)","v":"GA_9_02_AM"}]
[{"$f":"A26","v":5},"Mike Mangus",322,"GA",{"$f":"E26","v":"9_02"},"AM","GA_9_02_AM"]
[5,"John Jones",298.28571428571428,"GA","9_02","AM","GA_9_02_AM"]
[5,"Brian Koehler",447.42857142857144,"GA","9_02","AM","GA_9_02_AM"]
[5,"Wes Hawkins",1575,"GA","9_02","AM","GA_9_02_AM"]
[5,"Kevin Plumer",1825.0000000000002,"GA","9_02","AM","GA_9_02_AM"]
[5,"Christopher Koehler",471.14285714285711,"GA","9_02","AM","GA_9_02_AM"]
[6,"Sara Carter",638.70967741935488,"GA","9_02","PM","GA_9_02_PM"]
[{"$f":"A33","v":6},"Brian Koehler",938.18181818181813,"GA","9_02","PM","GA_9_02_PM"]
[{"$f":"A34","v":6},"Kevin Plumer",638.70967741935488,"GA","9_02","PM","GA_9_02_PM"]
[6,"William Brown",425.80645161290323,"GA","9_02","PM","GA_9_02_PM"]
[6,"Wes Hawkins",496.77419354838707,"GA","9_02","PM","GA_9_02_PM"]
[6,"Mike Mangus",1094.5454545454545,"GA","9_02","PM","GA_9_02_PM"]
[6,"Christopher Koehler",1207.2727272727273,"GA","9_02","PM","GA_9_02_PM"]
[7,"Kas Gaigalas",1378.9473684210525,"MI","9_08","AM","MI_9_08_AM"]
[7,"Craig Singer",1041.0526315789473,"MI",{"$f":"E40","v":"9_08"},"AM","MI_9_08_AM"]
[7,"Christopher Gaigalas",817.77777777777771,"MI",{"$f":"E41","v":"9_08"},"AM","MI_9_08_AM"]
[7,"Mark Roe",1272.2222222222222,"MI","9_08","AM","MI_9_08_AM"]
[8,"Kas Gaigalas",1705.5555555555557,"MI","9_08","PM","MI_9_08_PM"]
[8,"Craig Singer",1364.4444444444443,"MI","9_08","PM","MI_9_08_PM"]
[8,"Christopher Gaigalas",804.44444444444434,"MI","9_08","PM","MI_9_08_PM"]
[8,"Mark Roe",805.55555555555566,"MI","9_08","PM","MI_9_08_PM"]
[9,"Carl Camurati",665.76271186440681,"PA","9_15","AM","PA_9_15_AM"]
[{"$f":"A48","v":9},"Caleb Smith",1246.56,"PA",{"$f":"E48","v":"9_15"},{"$f":"F48","v":"AM"},"PA_9_15_AM"]
[{"$f":"A49","v":9},"Kevin Plumer",1602.7199999999998,"PA",{"$f":"E49","v":"9_15"},{"$f":"F49","v":"AM"},"PA_9_15_AM"]
[{"$f":"A50","v":9},"Matt Andrews",548.98305084745766,"PA","9_15","AM","PA_9_15_AM"]
[9,"Holly Moore",-76.720000000000027,"PA","9_15","AM","PA_9_15_AM"]
[9,"Marty Hayes",1424.64,"PA","9_15","AM","PA_9_15_AM"]
[9,"Ginger Andrews",382.54237288135596,"PA","9_15","AM","PA_9_15_AM"]
[9,"Tom Tanner",1424.64,"PA","9_15","AM","PA_9_15_AM"]
[9,"Rob Arena",548.98305084745766,"PA","9_15","AM","PA_9_15_AM"]
[9,"Brennen Schultz",1424.64,"PA","9_15","AM","PA_9_15_AM"]
[9,"Kas Gaigalas",632.2033898305084,"PA","9_15","AM","PA_9_15_AM"]
[9,"Steve Andrews",1780.8,"PA","9_15","AM","PA_9_15_AM"]
[9,"Rick Schultz",665.76271186440681,"PA","9_15","AM","PA_9_15_AM"]
[9,"Nate Graham",1602.7199999999998,"PA","9_15","AM","PA_9_15_AM"]
[9,"William Tustin",465.76271186440681,"PA","9_15","AM","PA_9_15_AM"]
[10,"Nate Graham",588.64864864864865,"PA","9_15","PM","PA_9_15_PM"]
[10,"Rick Schultz",1386.1052631578948,"PA","9_15","PM","PA_9_15_PM"]
[10,"Steve Andrews",654.05405405405406,"PA","9_15","PM","PA_9_15_PM"]
[10,"Kas Gaigalas",732.63157894736833,"PA","9_15","PM","PA_9_15_PM"]
[10,"Brennen Schultz",-676.75675675675677,"PA","9_15","PM","PA_9_15_PM"]
[10,"Rob Arena",1559.3684210526317,"PA","9_15","PM","PA_9_15_PM"]
[10,"Tom Tanner",1386.1052631578948,"PA","9_15","PM","PA_9_15_PM"]
[10,"Marty Hayes",-276.75675675675677,"PA","9_15","PM","PA_9_15_PM"]
[10,"Holly Moore",-242.16216216216213,"PA","9_15","PM","PA_9_15_PM"]
[10,"Matt Andrews",779.68421052631584,"PA","9_15","PM","PA_9_15_PM"]
[10,"Kevin Plumer",977.29729729729729,"PA","9_15","PM","PA_9_15_PM"]
[10,"Caleb Smith",715.67567567567573,"PA","9_15","PM","PA_9_15_PM"]
[10,"Carl Camurati",1386.1052631578948,"PA","9_15","PM","PA_9_15_PM"]
[11,"Mike Smith",1276.3157894736842,"MN","9_15","01","MN_9_15_01"]
[11,"Matt Larson",1227.6923076923076,"MN","9_15",{"$f":"F76","v":"01"},"MN_9_15_01"]
[11,"Tom Palmer",1403.0769230769231,"MN","9_15",{"$f":"F77","v":"01"},"MN_9_15_01"]
[11,"Randy Stiponovich",765.78947368421052,"MN","9_15","01","MN_9_15_01"]
[11,"Peter Ellison",510.52631578947364,"MN","9_15","01","MN_9_15_01"]
[11,"McCoy Helland",1227.6923076923076,"MN","9_15","01","MN_9_15_01"]
[11,"Tyler Helland",1578.4615384615386,"MN","9_15","01","MN_9_15_01"]
[11,"Bob Hoernemann",948.68421052631584,"MN","9_15","01","MN_9_15_01"]
[11,"Bryan Box",1148.6842105263158,"MN","9_15","01","MN_9_15_01"]
[11,"Zach Hoernemann",1403.0769230769231,"MN","9_15","01","MN_9_15_01"]
[12,"Mike Smith",1700,"MN","9_15","02","MN_9_15_02"]
[12,"Matt Larson",1190,"MN","9_15","02","MN_9_15_02"]
[12,"Rick Whitsell",1020,"MN","9_15","02","MN_9_15_02"]
[12,"Randy Stiponovich",756.70588235294122,"MN","9_15","02","MN_9_15_02"]
[12,"Peter Ellison",808.94117647058818,"MN","9_15","02",{"$f":"CONCATENATE(D90,\"_\",E90,\"_\",F90)","v":"MN_9_15_02"}]
[12,"Tom Palmer",1008.9411764705882,"MN","9_15","02","MN_9_15_02"]
[12,"Zach Hoernemann",1360,"MN","9_15","02","MN_9_15_02"]
[12,"Bob Hoernemann",1330,"MN","9_15","02","MN_9_15_02"]
[12,"McCoy Helland",882.82352941176464,"MN","9_15","02","MN_9_15_02"]
[12,"Tyler Helland",1135.0588235294117,"MN","9_15","02","MN_9_15_02"]
[12,"Bryan Box",567.52941176470586,"MN","9_15","02","MN_9_15_02"]
[13,"Mike Smith",1620.5882352941178,"MN","9_15","03","MN_9_15_03"]
[13,"Peter Ellison",949.47368421052624,"MN","9_15","03","MN_9_15_03"]
[13,"Randy Stiponovich",862.10526315789468,"MN","9_15","03","MN_9_15_03"]
[13,"Tom Palmer",1149.4736842105262,"MN","9_15","03","MN_9_15_03"]
[13,"Bob Hoernemann",1458.5294117647059,"MN","9_15","03","MN_9_15_03"]
[13,"Zach Hoernemann",1296.4705882352941,"MN","9_15","03","MN_9_15_03"]
[13,"Tyler Helland",1293.1578947368421,"MN","9_15","03","MN_9_15_03"]
[13,"McCoy Helland",1005.7894736842105,"MN","9_15","03","MN_9_15_03"]
[13,"Matt Larson",1134.4117647058822,"MN","9_15","03","MN_9_15_03"]
[14,"Randy Stiponovich",1056.5217391304348,"MN","9_16","01","MN_9_16_01"]
[14,"Bob Hoernemann",1260,"MN","9_16","01","MN_9_16_01"]
[14,"McCoy Helland",980,"MN",{"$f":"E107","v":"9_16"},{"$f":"F107","v":"01"},"MN_9_16_01"]
[14,"Tyler Helland",1584.7826086956522,"MN","9_16","01","MN_9_16_01"]
[14,"Peter Ellison",1120,"MN","9_16","01","MN_9_16_01"]
[14,"Tom Palmer",1120,"MN","9_16","01","MN_9_16_01"]
[14,"Zach Hoernemann",1408.695652173913,"MN","9_16","01","MN_9_16_01"]
[15,"Bob Hoernemann",629.6875,"MN","9_16","02","MN_9_16_02"]
[15,"Peter Ellison",737.5,"MN","9_16","02","MN_9_16_02"]
[{"$f":"A114","v":15},"Zach Hoernemann",1622.6086956521738,"MN","9_16","02","MN_9_16_02"]
[15,"Tom Palmer",737.5,"MN","9_16","02","MN_9_16_02"]
[15,"Randy Stiponovich",1366.9565217391305,"MN","9_16","02","MN_9_16_02"]
[15,"Tyler Helland",2050.4347826086955,"MN","9_16","02","MN_9_16_02"]
[15,"McCoy Helland",645.3125,"MN","9_16","02","MN_9_16_02"]
[16,"Mark Roe",884.21052631578948,"MI","9_29","01","MI_9_29_01"]
[16,"Will Cover",2675,"MI",{"$f":"E120","v":"9_29"},{"$f":"F120","v":"01"},"MI_9_29_01"]
[16,"Craig Singer",595.78947368421052,"MI",{"$f":"E121","v":"9_29"},{"$f":"F121","v":"01"},"MI_9_29_01"]
[16,"Kas Gaigalas",2675,"MI","9_29","01","MI_9_29_01"]
[17,"Craig Singer",1293.1578947368421,"MI","9_29","02","MI_9_29_02"]
[17,"Mark Roe",1436.8421052631579,"MI","9_29","02","MI_9_29_02"]
[17,"Will Cover",1100,"MI","9_29","02","MI_9_29_02"]
[17,"Kas Gaigalas",1100,"MI","9_29","02","MI_9_29_02"]
[18,"Kas Gaigalas",1111.1111111111111,"MI","10_20","01","MI_10_20_01"]
[18,"Bryan Box",800,"MI","10_20","01","MI_10_20_01"]
[18,"Will Cover",1111.1111111111111,"MI","10_20","01","MI_10_20_01"]
[18,"Andrew Le",777.77777777777783,"MI","10_20","01","MI_10_20_01"]
[18,"Jack Alvenus",586.47058823529403,"MI","10_20","01","MI_10_20_01"]
[18,"Craig Singer",1011.1764705882354,"MI","10_20","01","MI_10_20_01"]
[18,"Christopher Gaigalas",898.82352941176464,"MI","10_20","01","MI_10_20_01"]
[18,"Mark Roe",1123.5294117647059,"MI","10_20","01","MI_10_20_01"]
[19,"Andrew Le",406.53846153846155,"MI","10_20","01","MI_10_20_01"]
[19,"Kas Gaigalas",580.76923076923083,"MI","10_20","01","MI_10_20_01"]
[19,"Bryan Box",322.69230769230774,"MI","10_20","01","MI_10_20_01"]
[19,"Will Cover",1637.3333333333333,"MI","10_20","01","MI_10_20_01"]
[19,"Mark Roe",1232.6666666666667,"MI","10_20","01","MI_10_20_01"]
[20,"Kevin Plumer",1692.0000000000002,"LA","03_23","01","LA_03_23_01"]
[20,"Peter Ellison",1504,"LA",{"$f":"E141","v":"03_23"},"01","LA_03_23_01"]
[20,"Gerald Roberts",673.33333333333326,"LA",{"$f":"E142","v":"03_23"},"01","LA_03_23_01"]
[20,"Randy Stiponovich",1128,"LA","03_23","01","LA_03_23_01"]
[20,"Erik Helland",1692.0000000000002,"LA","03_23","01","LA_03_23_01"]
[20,"Tyler Helland",1091.6666666666667,"LA","03_23","01","LA_03_23_01"]
[20,"Tom Palmer",1504,"LA","03_23","01","LA_03_23_01"]
[20,"John Zaruba",1504,"LA","03_23","01","LA_03_23_01"]
[20,"Michael Tanzillo",891.66666666666674,"LA","03_23","01","LA_03_23_01"]
[20,"H Ted Buehring",673.33333333333326,"LA","03_23","01","LA_03_23_01"]
[20,"Rick Whitsell",1128,"LA","03_23","01","LA_03_23_01"]
[20,"Gary Powell",658,"LA","03_23","01","LA_03_23_01"]
[21,"Kevin Plumer",1849.655172413793,"LA","03_23","02","LA_03_23_02"]
[21,"Randy Stiponovich",535.4545454545455,"LA","03_23","02",{"$f":"CONCATENATE(D154,\"_\",E154,\"_\",F154)","v":"LA_03_23_02"}]
[21,"Michael Tanzillo",892.42424242424249,"LA","03_23","02","LA_03_23_02"]
[21,"John Zaruba",513.93939393939399,"LA","03_23","02","LA_03_23_02"]
[21,"David Haynes",713.93939393939399,"LA","03_23","02","LA_03_23_02"]
[21,"Gerald Roberts",713.93939393939399,"LA","03_23","02","LA_03_23_02"]
[21,"Gary Powell",719.31034482758616,"LA","03_23","02","LA_03_23_02"]
[21,"H Ted Buehring",713.93939393939399,"LA","03_23","02","LA_03_23_02"]
[21,"Erik Helland",1849.655172413793,"LA","03_23","02","LA_03_23_02"]
[21,"Tyler Helland",892.42424242424249,"LA","03_23","02","LA_03_23_02"]
[21,"Tom Palmer",1644.1379310344828,"LA","03_23","02","LA_03_23_02"]
[21,"Peter Ellison",1644.1379310344828,"LA","03_23","02","LA_03_23_02"]
[21,"Glenn Brandon Smith",713.93939393939399,"LA","03_23","02","LA_03_23_02"]
[21,"Rick Whitsell",1233.1034482758621,"LA","03_23","02","LA_03_23_02"]
[22,"Kevin Plumer",1582,"LA","03_23","03","LA_03_23_03"]
[22,"Tyler Helland",1312.7659574468084,"LA","03_23","03","LA_03_23_03"]
[22,"Glenn Brandon Smith",1050.2127659574469,"LA","03_23","03","LA_03_23_03"]
[22,"Erik Helland",1582,"LA","03_23","03","LA_03_23_03"]
[22,"H Ted Buehring",1406.2222222222222,"LA","03_23","03","LA_03_23_03"]
[22,"John Zaruba",850.21276595744689,"LA","03_23","03","LA_03_23_03"]
[22,"Peter Ellison",1406.2222222222222,"LA","03_23","03","LA_03_23_03"]
[22,"Tom Palmer",1050.2127659574469,"LA","03_23","03","LA_03_23_03"]
[22,"Gary Powell",918.93617021276589,"LA","03_23","03","LA_03_23_03"]
[22,"Rick Whitsell",1054.6666666666667,"LA","03_23","03","LA_03_23_03"]
[22,"Randy Stiponovich",587.659574468085,"LA","03_23","03","LA_03_23_03"]
[22,"Michael Tanzillo",878.8888888888888,"LA","03_23","03","LA_03_23_03"]
[23,"Kevin Plumer",1683.8181818181818,"LA","03_24","01","LA_03_24_01"]
[{"$f":"A179","v":23},"John Zaruba",534.4,"LA","03_24","01","LA_03_24_01"]
[23,"Erik Helland",1683.8181818181818,"LA","03_24","01","LA_03_24_01"]
[23,"Glenn Brandon Smith",1496.7272727272727,"LA","03_24","01","LA_03_24_01"]
[23,"Michael Tanzillo",718,"LA","03_24","01","LA_03_24_01"]
[23,"Gerald Roberts",1496.7272727272727,"LA","03_24","01","LA_03_24_01"]
[23,"David Haynes",734.4,"LA","03_24","01","LA_03_24_01"]
[23,"Peter Ellison",534.4,"LA","03_24","01","LA_03_24_01"]
[23,"Rick Whitsell",550.79999999999995,"LA","03_24","01","LA_03_24_01"]
[23,"Randy Stiponovich",1122.5454545454545,"LA","03_24","01","LA_03_24_01"]
[23,"Gary Powell",1309.6363636363635,"LA","03_24","01","LA_03_24_01"]
[23,"Tyler Helland",918,"LA","03_24","01","LA_03_24_01"]
[23,"Tom Palmer",1496.7272727272727,"LA","03_24","01","LA_03_24_01"]
[24,"Kevin Plumer",1064.1176470588236,"LA","03_24","02","LA_03_24_02"]
[24,"H Ted Buehring",472.94117647058823,"LA","03_24","02","LA_03_24_02"]
[24,"David Haynes",689.6,"LA","03_24","02","LA_03_24_02"]
[24,"Gerald Roberts",945.88235294117646,"LA","03_24","02","LA_03_24_02"]
[24,"Peter Ellison",689.6,"LA","03_24","02","LA_03_24_02"]
[24,"Erik Helland",1064.1176470588236,"LA","03_24","02","LA_03_24_02"]
[24,"Tyler Helland",862,"LA","03_24","02","LA_03_24_02"]
[24,"Tom Palmer",945.88235294117646,"LA","03_24","02","LA_03_24_02"]
[24,"Michael Tanzillo",862,"LA","03_24","02","LA_03_24_02"]
[24,"Gary Powell",827.64705882352951,"LA","03_24","02","LA_03_24_02"]
[24,"John Zaruba",689.6,"LA",{"$f":"E201","v":"03_24"},"02","LA_03_24_02"]
[24,"Randy Stiponovich",709.41176470588232,"LA","03_24","02","LA_03_24_02"]
[24,"Rick Whitsell",517.19999999999993,"LA","03_24","02","LA_03_24_02"]
[25,"Tom Palmer",953.10344827586209,"LA","03_24","03","LA_03_24_03"]
[25,"Gary Powell",825.99999999999989,"LA","03_24","03","LA_03_24_03"]
[25,"Kevin Plumer",1062,"LA","03_24","03","LA_03_24_03"]
[25,"Rick Whitsell",714.82758620689651,"LA","03_24","03","LA_03_24_03"]
[25,"John Zaruba",953.10344827586209,"LA","03_24","03","LA_03_24_03"]
[25,"Glenn Brandon Smith",944,"LA","03_24","03","LA_03_24_03"]
[25,"Gerald Roberts",944,"LA","03_24","03","LA_03_24_03"]
[25,"David Haynes",953.10344827586209,"LA","03_24","03","LA_03_24_03"]
[25,"H Ted Buehring",944,"LA","03_24","03","LA_03_24_03"]
[25,"Randy Stiponovich",708,"LA","03_24","03","LA_03_24_03"]
[25,"Peter Ellison",953.10344827586209,"LA","03_24","03","LA_03_24_03"]
[25,"Michael Tanzillo",1191.3793103448277,"LA",{"$f":"E215","v":"03_24"},"03","LA_03_24_03"]
[25,"Erik Helland",862,"LA","03_24","03","LA_03_24_03"]
[25,"Tyler Helland",991.37931034482767,"LA","03_24","03",{"$f":"CONCATENATE(D218,\"_\",E218,\"_\",F218)","v":"LA_03_24_03"}]
[25,null,null,null,null,null,"__"]
[25,null,null,null,null,null,"__"]
[25,null,null,null,null,null,"__"]
[25,null,null,null,null,null,"__"]
[25,null,null,null,null,null,"__"]
[25,null,null,null,null,null,"__"]
[null,null,null,null,null,null,"__"]
[null,null,null,null,null,null,"__"]
[null,null,null,null,null,null,"__"]
[null,null,null,null,null,null,"__"]
[null,null,null,null,null,null,"__"]
[null,null,null,null,null,null,"__"]
[null,null,null,null,null,null,"__"]
[null,null,null,null,null,null,"__"]
[null,null,null,null,null,null,"__"]
[null,null,null,null,null,null,"__"]
[null,null,null,null,null,null,"__"]
[null,null,null,null,null,null,"__"]
[null,null,null,null,null,null,"__"]
[null,null,null,null,null,null,"__"]
[null,null,null,null,null,null,"__"]
[null,null,null,null,null,null,"__"]
[null,null,null,null,null,null,"__"]
[null,null,null,null,null,null,"__"]
[null,null,null,null,null,null,"__"]
[null,null,null,null,null,null,"__"]
[null,null,null,null,null,null,"__"]
[null,null,null,null,null,null,"__"]
[null,null,null,null,null,null,"__"]
[null,null,null,null,null,null,"__"]
[null,null,null,null,null,null,"__"]
[null,null,null,null,null,null,"__"]
[null,null,null,null,null,null,"__"]
[null,null,null,null,null,null,"__"]
[null,null,null,null,null,null,"__"]
[null,null,null,null,null,null,"__"]
[null,null,null,null,null,null,"__"]
[null,null,null,null,null,null,"__"]
[null,null,null,null,null,null,"__"]
[null,null,null,null,null,null,"__"]
[null,null,null,null,null,null,"__"]
[null,null,null,null,null,null,"__"]
[null,null,null,null,null,null,"__"]
[null,null,null,null,null,null,"__"]
[null,null,null,null,null,null,"__"]
[null,null,null,null,null,null,"__"]
[null,null,null,null,null,null,"__"]
[null,null,null,null,null,null,"__"]
[null,null,null,null,null,null,"__"]
[null,null,null,null,null,null,"__"]
[null,null,null,null,null,null,"__"]
[null,null,null,null,null,null,"__"]
[null,null,null,null,null,null,"__"]
[null,null,null,null,null,null,"__"]
[null,null,null,null,null,null,"__"]
[null,null,null,null,null,null,"__"]
[null,null,null,null,null,null,"__"]
[null,null,null,null,null,null,"__"]
[null,null,null,null,null,null,"__"]
[null,null,null,null,null,null,"__"]
[null,null,null,null,null,null,"__"]
[null,null,null,null,null,null,"__"]
[null,null,null,null,null,null,"__"]
[null,null,null,null,null,null,{"$f":"CONCATENATE(D282,\"_\",E282,\"_\",F282)","v":"__"}]
[null,null,null,null,null,null,"__"]
[null,null,null,null,null,null,"__"]
[null,null,null,null,null,null,"__"]
[null,null,null,null,null,null,"__"]
[null,null,null,null,null,null,"__"]
[null,null,null,null,null,null,"__"]
[null,null,null,null,null,null,"__"]
[null,null,null,null,null,null,"__"]
[null,null,null,null,null,null,"__"]
[null,null,null,null,null,null,"__"]
[null,null,null,null,null,null,"__"]
[null,null,null,null,null,null,"__"]
[null,null,null,null,null,null,"__"]
[null,null,null,null,null,null,"__"]
[null,null,null,null,null,null,"__"]
[null,null,null,null,null,null,"__"]
[null,null,null,null,null,null,"__"]
[null,null,null,null,null,null,"__"]
[null,null,null,null,null,null,"__"]
[null,null,null,null,null,null,"__"]
[null,null,null,null,null,null,"__"]
[null,null,null,null,null,null,"__"]
[null,null,null,null,null,null,"__"]
[null,null,null,null,null,null,"__"]
[null,null,null,null,null,null,"__"]
[null,null,null,null,null,null,"__"]
[null,null,null,null,null,null,"__"]
[null,null,null,null,null,null,"__"]
[null,null,null,null,null,null,"__"]
[null,null,null,null,null,null,"__"]
[null,null,null,null,null,null,"__"]
[null,null,null,null,null,null,"__"]
[null,null,null,null,null,null,"__"]
[null,null,null,null,null,null,"__"]
[null,null,null,null,null,null,"__"]
[null,null,null,null,null,null,"__"]
[null,null,null,null,null,null,"__"]
[null,null,null,null,null,null,"__"]
[null,null,null,null,null,null,"__"]
[null,null,null,null,null,null,"__"]
[null,null,null,null,null,null,"__"]
[null,null,null,null,null,null,"__"]
[null,null,null,null,null,null,"__"]
[null,null,null,null,null,null,"__"]
[null,null,null,null,null,null,"__"]
[null,null,null,null,null,null,"__"]
[null,null,null,null,null,null,"__"]
[null,null,null,null,null,null,"__"]
[null,null,null,null,null,null,"__"]
[null,null,null,null,null,null,"__"]
[null,null,null,null,null,null,"__"]
[null,null,null,null,null,null,"__"]
[null,null,null,null,null,null,"__"]
[null,null,null,null,null,null,"__"]
[null,null,null,null,null,null,"__"]
[null,null,null,null,null,null,"__"]
[null,null,null,null,null,null,"__"]
[null,null,null,null,null,null,"__"]
[null,null,null,null,null,null,"__"]
[null,null,null,null,null,null,"__"]
[null,null,null,null,null,null,"__"]
[null,null,null,null,null,null,"__"]
[null,null,null,null,null,null,"__"]
[null,null,null,null,null,null,{"$f":"CONCATENATE(D346,\"_\",E346,\"_\",F346)","v":"__"}]
[null,null,null,null,null,null,"__"]
[null,null,null,null,null,null,"__"]
[null,null,null,null,null,null,"__"]
[null,null,null,null,null,null,"__"]
[null,null,null,null,null,null,"__"]
[null,null,null,null,null,null,"__"]
[null,null,null,null,null,null,"__"]
[null,null,null,null,null,null,"__"]
[null,null,null,null,null,null,"__"]
[null,null,null,null,null,null,"__"]
[null,null,null,null,null,null,"__"]
[null,null,null,null,null,null,"__"]
[null,null,null,null,null,null,"__"]
[null,null,null,null,null,null,"__"]
[null,null,null,null,null,null,"__"]
[null,null,null,null,null,null,"__"]
[null,null,null,null,null,null,"__"]
[null,null,null,null,null,null,"__"]
[null,null,null,null,null,null,"__"]
[null,null,null,null,null,null,"__"]
[null,null,null,null,null,null,"__"]
[null,null,null,null,null,null,"__"]
[null,null,null,null,null,null,"__"]
[null,null,null,null,null,null,"__"]
[null,null,null,null,null,null,"__"]
[null,null,null,null,null,null,"__"]
[null,null,null,null,null,null,"__"]
[null,null,null,null,null,null,"__"]
[null,null,null,null,null,null,"__"]
[null,null,null,null,null,null,"__"]
[null,null,null,null,null,null,"__"]
[null,null,null,null,null,null,"__"]
[null,null,null,null,null,null,"__"]
[null,null,null,null,null,null,"__"]
[null,null,null,null,null,null,"__"]
[null,null,null,null,null,null,"__"]
[null,null,null,null,null,null,"__"]
[null,null,null,null,null,null,"__"]
[null,null,null,null,null,null,"__"]
[null,null,null,null,null,null,"__"]
[null,null,null,null,null,null,"__"]
[null,null,null,null,null,null,"__"]
[null,null,null,null,null,null,"__"]
[null,null,null,null,null,null,"__"]
[null,null,null,null,null,null,"__"]
[null,null,null,null,null,null,"__"]
[null,null,null,null,null,null,"__"]
[null,null,null,null,null,null,"__"]
[null,null,null,null,null,null,"__"]
[null,null,null,null,null,null,"__"]
[null,null,null,null,null,null,"__"]
[null,null,null,null,null,null,"__"]
[null,null,null,null,null,null,"__"]
[null,null,null,null,null,null,"__"]
[null,null,null,null,null,null,"__"]
[null,null,null,null,null,null,"__"]
[null,null,null,null,null,null,"__"]
[null,null,null,null,null,null,"__"]
[null,null,null,null,null,null,"__"]
[null,null,null,null,null,null,"__"]
[null,null,null,null,null,null,"__"]
[null,null,null,null,null,null,"__"]
[null,null,null,null,null,null,"__"]
[null,null,null,null,null,null,{"$f":"CONCATENATE(D410,\"_\",E410,\"_\",F410)","v":"__"}]
[null,null,null,null,null,null,"__"]
[null,null,null,null,null,null,"__"]
[null,null,null,null,null,null,"__"]
[null,null,null,null,null,null,"__"]
[null,null,null,null,null,null,"__"]
[null,null,null,null,null,null,"__"]
[null,null,null,null,null,null,"__"]
[null,null,null,null,null,null,"__"]
[null,null,null,null,null,null,"__"]
[null,null,null,null,null,null,"__"]
[null,null,null,null,null,null,"__"]
[null,null,null,null,null,null,"__"]
[null,null,null,null,null,null,"__"]
[null,null,null,null,null,null,"__"]
[null,null,null,null,null,null,"__"]
[null,null,null,null,null,null,"__"]
[null,null,null,null,null,null,"__"]
[null,null,null,null,null,null,"__"]
[null,null,null,null,null,null,"__"]
[null,null,null,null,null,null,"__"]
[null,null,null,null,null,null,"__"]
[null,null,null,null,null,null,"__"]
[null,null,null,null,null,null,"__"]
[null,null,null,null,null,null,"__"]
[null,null,null,null,null,null,"__"]
[null,null,null,null,null,null,"__"]
[null,null,null,null,null,null,"__"]
[null,null,null,null,null,null,"__"]
[null,null,null,null,null,null,"__"]
[null,null,null,null,null,null,"__"]
[null,null,null,null,null,null,"__"]
[null,null,null,null,null,null,"__"]
[null,null,null,null,null,null,"__"]
[null,null,null,null,null,null,"__"]
[null,null,null,null,null,null,"__"]
[null,null,null,null,null,null,"__"]
[null,null,null,null,null,null,"__"]
[null,null,null,null,null,null,"__"]
[null,null,null,null,null,null,"__"]
[null,null,null,null,null,null,"__"]
[null,null,null,null,null,null,"__"]
[null,null,null,null,null,null,"__"]
[null,null,null,null,null,null,"__"]
[null,null,null,null,null,null,"__"]
[null,null,null,null,null,null,"__"]
[null,null,null,null,null,null,"__"]
[null,null,null,null,null,null,"__"]
[null,null,null,null,null,null,"__"]
[null,null,null,null,null,null,"__"]
[null,null,null,null,null,null,"__"]
[null,null,null,null,null,null,"__"]
[null,null,null,null,null,null,"__"]
[null,null,null,null,null,null,"__"]
[null,null,null,null,null,null,"__"]
[null,null,null,null,null,null,"__"]
[null,null,null,null,null,null,"__"]
[null,null,null,null,null,null,"__"]
[null,null,null,null,null,null,"__"]
[null,null,null,null,null,null,"__"]
[null,null,null,null,null,null,"__"]
[null,null,null,null,null,null,"__"]
[null,null,null,null,null,null,"__"]
[null,null,null,null,null,null,"__"]
[null,null,null,null,null,null,{"$f":"CONCATENATE(D474,\"_\",E474,\"_\",F474)","v":"__"}]
[null,null,null,null,null,null,"__"]
[null,null,null,null,null,null,"__"]
[null,null,null,null,null,null,"__"]
[null,null,null,null,null,null,"__"]
[null,null,null,null,null,null,"__"]
[null,null,null,null,null,null,"__"]
[null,null,null,null,null,null,"__"]
[null,null,null,null,null,null,"__"]
[null,null,null,null,null,null,"__"]
[null,null,null,null,null,null,"__"]
[null,null,null,null,null,null,"__"]
[null,null,null,null,null,null,"__"]
[null,null,null,null,null,null,"__"]
[null,null,null,null,null,null,"__"]
[null,null,null,null,null,null,"__"]
[null,null,null,null,null,null,"__"]
[null,null,null,null,null,null,"__"]
[null,null,null,null,null,null,"__"]
[null,null,null,null,null,null,"__"]
[null,null,null,null,null,null,"__"]
[null,null,null,null,null,null,"__"]
[null,null,null,null,null,null,"__"]
[null,null,null,null,null,null,"__"]
[null,null,null,null,null,null,"__"]
[null,null,null,null,null,null,"__"]
[null,null,null,null,null,null,"__"]

{"sheet":"Instructions","index":2,"n_rows":13,"n_cols":2,"rows_kept":13,"cut":false,"hidden":false,"merged":[[8,1,8,11],[10,0,10,10],[12,0,12,6],[1,0,1,12],[3,0,3,15],[5,0,5,7],[7,0,7,12]]}
[]
["Ensure that all participating captains/ships are entered into the Captian Tab."]
[]
["Make a COPY of the \"Master Score Sheet\" tab and rename it to the name of the battle to be scored."]
[]
["Enter Opposing Fleet Names into Cells B2 & B3"]
[]
["Use the \"Enter Score\" button to enter the socres for ALL battlers in the battle."]
[null,"DO NOT CLOSE THE WINDOW UNTIL ALL SCORES ARE ENTERED"]
[]
["Use the \"Calculate Totals\" button to finish the scoring of the battle"]
[]
["The Winner will be displayed in Cell J1"]

{"sheet":"Captain","index":3,"n_rows":15,"n_cols":4,"rows_kept":15,"cut":false,"hidden":false,"merged":[]}
["Captian","Ship","Class","Units"]
["Peter Ellison","Erin",4,4.5]
["Randy Stiponovich","Glorie",2,2.5]
["Tyler Helland","Nagato",6,6]
["Tom Palmer","Alaska",4,4.5]
["Rick Whitsell","Jamaica",2,2.5]
["Kevin Plumer","Agincourt",5,5.5]
["David Haynes","Kawachi",4,4.5]
["Gerald Roberts","Kongo",4,4.5]
["Glenn Brandon Smith","Andrea Doria",4,4.5]
["H Ted Buehring","VDT",4,4]
["Michael Tanzillo","Bismarck",6,6.5]
["Erik Helland","Barham",5,5.5]
["John Zaruba","Andrea Doria",4,4.5]
["Gary Powell","Des Moines",3,3.5]

{"sheet":"Master Sheet","index":4,"n_rows":4,"n_cols":19,"rows_kept":4,"cut":false,"hidden":false,"merged":[]}
[null,null,null,null,null,null,null,null,"Winner:",{"$f":"IF(K2>K3, B2, IF(K3>K2, B3, \"Tie\"))","v":"Allied"}]
["Fleet 1 :","Allied",null,"Fleet Units:",8,"Fleet Weight:",10,"Fleet Battle Damage:",600,"Fleet Score:",1800]
["Fleet 2 :","Axis",null,"Fleet Units:",8,"Fleet Weight:",10,"Fleet Battle Damage:",1800,"Fleet Score:",600]
["Captian","Ship","Fleet","Class","Units","Above","On","Below","Sinks","Participate all Sorties","Penalties Points","2nd Sortie Sink","Damage Points","Scored By","Notes","Weight Factor","Weight Points","Captian","Captain Points"]

{"sheet":"03_24_03_LA","index":5,"n_rows":18,"n_cols":19,"rows_kept":18,"cut":false,"hidden":false,"merged":[]}
[null,null,null,null,null,null,null,null,"Winner:",{"$f":"IF(K2>K3, B2, IF(K3>K2, B3, \"Tie\"))","v":"Flag"}]
["Fleet 1 :","Flag",null,"Fleet Units:",33,"Fleet Weight:",58,"Fleet Battle Damage:",6490,"Fleet Score:",6910]
["Fleet 2 :","No-flag",null,"Fleet Units:",30,"Fleet Weight:",55,"Fleet Battle Damage:",6910,"Fleet Score:",6490]
["Captian","Ship","Fleet","Class","Units","Above","On","Below","Sinks","Participate all Sorties","Penalties Points","2nd Sortie Sink","Damage Points","Scored By","Notes","Weight Factor","Weight Points","Captian","Captain Points"]
["Tom Palmer","Alaska","Flag",4,4.5,16,4,18,0,1,0,0,780,"Tom","None,None,None",8,953.10344827586209,"Tom Palmer",953.10344827586209]
["Gary Powell","Des Moines","No-flag",3,3.5,16,6,7,0,1,0,0,490,"Gary","None,None,None",7,825.99999999999989,"Gary Powell",825.99999999999989]
["Kevin Plumer","Agincourt","No-flag",5,5.5,76,13,54,0,1,0,0,2640,"Kevin","None,None,None",9,1062,"Kevin Plumer",1062]
["Rick Whitsell","Jamaica","Flag",2,2.5,2,0,0,0,1,0,0,20,"Kevin","None,None,None",6,714.82758620689651,"Rick Whitsell",714.82758620689651]
["John Zaruba","Andrea Doria","Flag",4,4.5,24,2,3,0,1,0,0,370,"John","None,None,None",8,953.10344827586209,"John Zaruba",953.10344827586209]
["Glenn Brandon Smith","Andrea Doria","No-flag",4,4.5,5,1,2,0,1,0,0,130,"glenn","None,None,None",8,944,"Glenn Brandon Smith",944]
["Gerald Roberts","Kongo","No-flag",4,4.5,15,0,3,0,1,0,0,240,"Gerald","None,None,None",8,944,"Gerald Roberts",944]
["David Haynes","Kawachi","Flag",4,4.5,24,1,3,0,1,0,0,350,"Dave","None,None,None",8,953.10344827586209,"David Haynes",953.10344827586209]
["H Ted Buehring","VDT","No-flag",4,4,12,2,9,0,1,0,0,430,"Ted","None,None,None",8,944,"H Ted Buehring",944]
["Randy Stiponovich","Glorie","No-flag",2,2.5,3,6,10,0,1,0,0,450,"Randy","None,None,None",6,708,"Randy Stiponovich",708]
["Peter Ellison","Erin","Flag",4,4.5,33,3,5,0,1,0,0,540,"Peter","None,None,None",8,953.10344827586209,"Peter Ellison",953.10344827586209]
["Michael Tanzillo","Bismarck","Flag",6,6.5,18,7,6,0,1,0,0,500,"Mike","None,None,None",10,1191.3793103448277,"Michael Tanzillo",1191.3793103448277]
["Erik Helland","Barham","No-flag",5,5.5,103,0,20,1,1,0,1,2530,"Erik","None,None,None",9,1062,"Erik Helland",862]
["Tyler Helland","Nagato","Flag",6,6,81,19,58,1,1,0,1,3930,"Tyler","None,None,None",10,1191.3793103448277,"Tyler Helland",991.37931034482767]

{"sheet":"03_24_02_LA","index":6,"n_rows":17,"n_cols":19,"rows_kept":17,"cut":false,"hidden":false,"merged":[]}
[null,null,null,null,null,null,null,null,"Winner:",{"$f":"IF(K2>K3, B2, IF(K3>K2, B3, \"Tie\"))","v":"No-Flag"}]
["Fleet 1 :","Flag",null,"Fleet Units:",28.5,"Fleet Weight:",50,"Fleet Battle Damage:",6030,"Fleet Score:",4310]
["Fleet 2 :","No-Flag",null,"Fleet Units:",30,"Fleet Weight:",51,"Fleet Battle Damage:",4310,"Fleet Score:",6030]
["Captian","Ship","Fleet","Class","Units","Above","On","Below","Sinks","Participate all Sorties","Penalties Points","2nd Sortie Sink","Damage Points","Scored By","Notes","Weight Factor","Weight Points","Captian","Captain Points"]
["Kevin Plumer","Agincourt","No-Flag",5,5.5,8,3,12,0,1,0,0,500,"Kevin","None,None,None",9,1064.1176470588236,"Kevin Plumer",1064.1176470588236]
["H Ted Buehring","VDT","No-Flag",4,4,33,4,4,0,0,0,0,530,"Peter","None,None,None",4,472.94117647058823,"H Ted Buehring",472.94117647058823]
["David Haynes","Kawachi","Flag",4,4.5,21,6,11,0,1,0,0,660,"Dave","None,None,None",8,689.6,"David Haynes",689.6]
["Gerald Roberts","Kongo","No-Flag",4,4.5,54,4,27,0,1,0,0,1430,"Gerald","None,None,None",8,945.88235294117646,"Gerald Roberts",945.88235294117646]
["Peter Ellison","Erin","Flag",4,4.5,108,31,46,0,1,0,0,3080,"Peter","None,None,None",8,689.6,"Peter Ellison",689.6]
["Erik Helland","Barham","No-Flag",5,5.5,65,1,14,0,1,0,0,1090,"Erik","None,None,None",9,1064.1176470588236,"Erik Helland",1064.1176470588236]
["Tyler Helland","Nagato","Flag",6,6,41,5,20,0,1,0,0,1110,"Tyler","None,None,None",10,862,"Tyler Helland",862]
["Tom Palmer","Alaska","No-Flag",4,4.5,20,5,8,0,1,0,0,540,"Tom","None,None,None",8,945.88235294117646,"Tom Palmer",945.88235294117646]
["Michael Tanzillo","Bismarck","Flag",6,6.5,22,4,8,0,1,0,0,540,"Mike","None,None,None",10,862,"Michael Tanzillo",862]
["Gary Powell","Des Moines","No-Flag",3,3.5,9,2,1,0,1,0,0,160,"Gary","None,None,None",7,827.64705882352951,"Gary Powell",827.64705882352951]
["John Zaruba","Andrea Doria","Flag",4,4.5,35,0,8,0,1,0,0,590,"John","None,None,None",8,689.6,"John Zaruba",689.6]
["Randy Stiponovich","Glorie","No-Flag",2,2.5,4,1,0,0,1,0,0,60,"Randy","None,None,None",6,709.41176470588232,"Randy Stiponovich",709.41176470588232]
["Rick Whitsell","Jamaica","Flag",2,2.5,2,0,1,0,1,0,0,50,"Rick","None,None,None",6,517.19999999999993,"Rick Whitsell",517.19999999999993]

{"sheet":"03_24_01_LA","index":7,"n_rows":17,"n_cols":19,"rows_kept":17,"cut":false,"hidden":false,"merged":[]}
[null,null,null,null,null,null,null,null,"Winner:",{"$f":"IF(K2>K3, B2, IF(K3>K2, B3, \"Tie\"))","v":"No-Flag"}]
["Fleet 1 :","Flag",null,"Fleet Units:",28.5,"Fleet Weight:",50,"Fleet Battle Damage:",10290,"Fleet Score:",4590]
["Fleet 2 :","No-Flag",null,"Fleet Units:",30.5,"Fleet Weight:",55,"Fleet Battle Damage:",4590,"Fleet Score:",10290]
["Captian","Ship","Fleet","Class","Units","Above","On","Below","Sinks","Participate all Sorties","Penalties Points","2nd Sortie Sink","Damage Points","Scored By","Notes","Weight Factor","Weight Points","Captian","Captain Points"]
["Kevin Plumer","Agincourt","No-Flag",5,5.5,43,6,36,0,1,0,0,1630,"Kevin","None,None,None",9,1683.8181818181818,"Kevin Plumer",1683.8181818181818]
["John Zaruba","Andrea Doria","Flag",4,4.5,32,5,22,1,1,0,1,1880,"John","None,None,None",8,734.4,"John Zaruba",534.4]
["Erik Helland","Barham","No-Flag",5,5.5,60,1,25,0,1,0,0,1370,"Kevin","None,None,None",9,1683.8181818181818,"Erik Helland",1683.8181818181818]
["Glenn Brandon Smith","Andrea Doria","No-Flag",4,4.5,14,0,5,0,1,0,0,290,"Glenn","None,None,None",8,1496.7272727272727,"Glenn Brandon Smith",1496.7272727272727]
["Michael Tanzillo","Bismarck","Flag",6,6.5,76,14,25,1,1,0,1,2790,"Mike","None,None,None",10,918,"Michael Tanzillo",718]
["Gerald Roberts","Kongo","No-Flag",4,4.5,20,1,10,0,1,0,0,520,"Gelard","None,None,None",8,1496.7272727272727,"Gerald Roberts",1496.7272727272727]
["David Haynes","Kawachi","Flag",4,4.5,40,9,26,0,1,0,0,1360,"David","None,None,None",8,734.4,"David Haynes",734.4]
["Peter Ellison","Erin","Flag",4,4.5,85,20,40,1,1,0,1,3250,"Peter","None,None,None",8,734.4,"Peter Ellison",534.4]
["Rick Whitsell","Jamaica","Flag",2,2.5,4,1,0,0,1,0,0,60,"Rick","None,None,None",6,550.79999999999995,"Rick Whitsell",550.79999999999995]
["Randy Stiponovich","Glorie","No-Flag",2,2.5,1,0,2,0,1,0,0,70,"Randy","None,None,None",6,1122.5454545454545,"Randy Stiponovich",1122.5454545454545]
["Gary Powell","Des Moines","No-Flag",3,3.5,10,4,4,0,1,0,0,300,"Gary","None,None,None",7,1309.6363636363635,"Gary Powell",1309.6363636363635]
["Tyler Helland","Nagato","Flag",6,6,32,9,15,0,1,0,0,950,"Tyler","None,None,None",10,918,"Tyler Helland",918]
["Tom Palmer","Alaska","No-Flag",4,4.5,21,4,4,0,1,0,0,410,"Tom","None,None,None",8,1496.7272727272727,"Tom Palmer",1496.7272727272727]

{"sheet":"03_23_03_LA","index":8,"n_rows":16,"n_cols":19,"rows_kept":16,"cut":false,"hidden":false,"merged":[]}
[null,null,null,null,null,null,null,null,"Winner:",{"$f":"IF(K2>K3, B2, IF(K3>K2, B3, \"Tie\"))","v":"Flag"}]
["Fleet 1 :","Flag",null,"Fleet Units:",28.5,"Fleet Weight:",45,"Fleet Battle Damage:",6170,"Fleet Score:",7909.99951171875]
["Fleet 2 :","No Flag",null,"Fleet Units:",25.5,"Fleet Weight:",47,"Fleet Battle Damage:",7910,"Fleet Score:",6170]
["Captian","Ship","Fleet","Class","Units","Above","On","Below","Sinks","Participate all Sorties","Penalties Points","2nd Sortie Sink","Damage Points","Scored By","Notes","Weight Factor","Weight Points","Captian","Captain Points"]
["Kevin Plumer","Agincourt","Flag",5,5.5,39,9,37,0,1,0,0,1680,"Kevin","None,None,None",9,1582,"Kevin Plumer",1582]
["Tyler Helland","Nagato","No Flag",6,6,82,9,44,0,1,0,0,2320,"Tyler","None,None,None",10,1312.7659574468084,"Tyler Helland",1312.7659574468084]
["Glenn Brandon Smith","Andrea Doria","No Flag",4,4.5,26,9,10,0,1,0,0,740,"Glenn","None,None,None",8,1050.2127659574469,"Glenn Brandon Smith",1050.2127659574469]
["Erik Helland","Barham","Flag",5,5.5,60,0,18,0,1,0,0,1140,"Erik","None,None,None",9,1582,"Erik Helland",1582]
["H Ted Buehring","VDT","Flag",4,4,3,1,4,0,1,0,0,170,"Ted","None,None,None",8,1406.2222222222222,"H Ted Buehring",1406.2222222222222]
["John Zaruba","Andrea Doria","No Flag",4,4.5,46,3,21,2,1,0,1,2750,"John","None,None,None",8,1050.2127659574469,"John Zaruba",850.21276595744689]
["Peter Ellison","Erin","Flag",4,4.5,35,8,11,0,1,0,0,840,"Peter","None,None,None",8,1406.2222222222222,"Peter Ellison",1406.2222222222222]
["Tom Palmer","Alaska","No Flag",4,4.5,26,4,13,0,1,0,0,730,"Tom","None,None,None",8,1050.2127659574469,"Tom Palmer",1050.2127659574469]
["Gary Powell","Des Moines","No Flag",3,3.5,19,1,1,0,1,0,0,240,"Gary","None,None,None",7,918.93617021276589,"Gary Powell",918.93617021276589]
["Rick Whitsell","Jamaica","Flag",2,2.5,4,0,0,0,1,0,0,40,"Rick","None,None,None",6,1054.6666666666667,"Rick Whitsell",1054.6666666666667]
["Randy Stiponovich","Glorie","No Flag",2,2.5,10,5,11,1,1,0,1,1130,"Randy","None,None,None",6,787.659574468085,"Randy Stiponovich",587.659574468085]
["Michael Tanzillo","Bismarck","Flag",6,6.5,35,7,27,1,0,0,0,2300,"Mike","None,None,None",5,878.8888888888888,"Michael Tanzillo",878.8888888888888]

{"sheet":"03_23_02_LA","index":9,"n_rows":18,"n_cols":19,"rows_kept":18,"cut":false,"hidden":false,"merged":[]}
[null,null,null,null,null,null,null,null,"Winner:",{"$f":"IF(K2>K3, B2, IF(K3>K2, B3, \"Tie\"))","v":"Allied"}]
["Fleet 1 :","Allied",null,"Fleet Units:",26,"Fleet Weight:",43.5,"Fleet Battle Damage:",5890,"Fleet Score:",8939.9990234375]
["Fleet 2 :","Axis",null,"Fleet Units:",37,"Fleet Weight:",66,"Fleet Battle Damage:",8940,"Fleet Score:",5890]
["Captian","Ship","Fleet","Class","Units","Above","On","Below","Sinks","Participate all Sorties","Penalties Points","2nd Sortie Sink","Damage Points","Scored By","Notes","Weight Factor","Weight Points","Captian","Captain Points"]
["Kevin Plumer","Agincourt","Allied",5,5.5,29,5,25,0,1,0,0,1140,"Kevin","None,None,None",9,1849.655172413793,"Kevin Plumer",1849.655172413793]
["Randy Stiponovich","Glorie","Axis",2,2.5,12,3,4,0,1,0,0,300,"Randy","None,None,None",6,535.4545454545455,"Randy Stiponovich",535.4545454545455]
["Michael Tanzillo","Bismarck","Axis",6,6.5,57,6,32,0,1,0,0,1650,"Mike","None,None,None",10,892.42424242424249,"Michael Tanzillo",892.42424242424249]
["John Zaruba","Andrea Doria","Axis",4,4.5,22,3,21,2,1,0,1,2510,"John","None,None,None",8,713.93939393939399,"John Zaruba",513.93939393939399]
["David Haynes","Kawachi","Axis",4,4.5,8,5,5,0,1,0,0,330,"Dave","None,None,None",8,713.93939393939399,"David Haynes",713.93939393939399]
["Gerald Roberts","Kongo","Axis",4,4.5,34,2,7,0,1,0,0,590,"Gerald","None,None,None",8,713.93939393939399,"Gerald Roberts",713.93939393939399]
["Gary Powell","Des Moines","Allied",3,3.5,25,5,14,1,0,0,0,1470,"Gary","None,None,None",3.5,719.31034482758616,"Gary Powell",719.31034482758616]
["H Ted Buehring","VDT","Axis",4,4,17,7,7,0,1,0,0,520,"Ted","None,None,None",8,713.93939393939399,"H Ted Buehring",713.93939393939399]
["Erik Helland","Barham","Allied",5,5.5,75,3,8,0,1,0,0,1050,"Erik","None,None,None",9,1849.655172413793,"Erik Helland",1849.655172413793]
["Tyler Helland","Nagato","Axis",6,6,44,11,36,0,1,0,0,1740,"Tyler","None,None,None",10,892.42424242424249,"Tyler Helland",892.42424242424249]
["Tom Palmer","Alaska","Allied",4,4.5,25,8,26,0,1,0,0,1190,"Tom","None,None,None",8,1644.1379310344828,"Tom Palmer",1644.1379310344828]
["Peter Ellison","Erin","Allied",4,4.5,32,7,19,0,1,0,0,1030,"Peter","None,None,None",8,1644.1379310344828,"Peter Ellison",1644.1379310344828]
["Glenn Brandon Smith","Andrea Doria","Axis",4,4.5,31,12,25,0,1,0,0,1300,"Glenn","None,None,None",8,713.93939393939399,"Glenn Brandon Smith",713.93939393939399]
["Rick Whitsell","Jamaica","Allied",2,2.5,1,0,0,0,1,0,0,10,"Rick","None,None,None",6,1233.1034482758621,"Rick Whitsell",1233.1034482758621]

{"sheet":"03_23_01_LA","index":10,"n_rows":16,"n_cols":19,"rows_kept":16,"cut":false,"hidden":false,"merged":[]}
[null,null,null,null,null,null,null,null,"Winner:",{"$f":"IF(K2>K3, B2, IF(K3>K2, B3, \"Tie\"))","v":"Allied"}]
["Fleet 1 :","Allied",null,"Fleet Units:",33,"Fleet Weight:",57.5,"Fleet Battle Damage:",3930,"Fleet Score:",10810]
["Fleet 2 :","Axis",null,"Fleet Units:",21,"Fleet Weight:",36,"Fleet Battle Damage:",10810,"Fleet Score:",3930]
["Captian","Ship","Fleet","Class","Units","Above","On","Below","Sinks","Participate all Sorties","Penalties Points","2nd Sortie Sink","Damage Points","Scored By","Notes","Weight Factor","Weight Points","Captian","Captain Points"]
["Kevin Plumer","Agincourt","Allied",5,5.5,16,2,11,0,1,0,0,530,"Kevin","None,None,None",9,1692.0000000000002,"Kevin Plumer",1692.0000000000002]
["Peter Ellison","Erin","Allied",4,4.5,9,0,10,0,1,0,0,390,"Peter","None,None,None",8,1504,"Peter Ellison",1504]
["Gerald Roberts","Kongo","Axis",4,4.5,65,9,56,1,1,0,1,3310,"Randy","None,None,None",8,873.33333333333326,"Gerald Roberts",673.33333333333326]
["Randy Stiponovich","Glorie","Allied",2,2.5,0,1,4,0,1,0,0,140,"Randy","None,None,None",6,1128,"Randy Stiponovich",1128]
["Erik Helland","Barham","Allied",5,5.5,46,9,17,0,1,0,0,1150,"Erik","None,None,None",9,1692.0000000000002,"Erik Helland",1692.0000000000002]
["Tyler Helland","Nagato","Axis",6,6,91,10,37,0,1,0,0,2220,"Tyler","None,None,None",10,1091.6666666666667,"Tyler Helland",1091.6666666666667]
["Tom Palmer","Alaska","Allied",4,4.5,23,0,16,0,1,0,0,710,"Tom","None,None,None",8,1504,"Tom Palmer",1504]
["John Zaruba","Andrea Doria","Allied",4,4.5,43,4,15,0,1,0,0,960,"Ted","None,None,None",8,1504,"John Zaruba",1504]
["Michael Tanzillo","Bismarck","Axis",6,6.5,73,22,42,1,1,0,1,3430,"Mike","None,None,None",10,1091.6666666666667,"Michael Tanzillo",891.66666666666674]
["H Ted Buehring","VDT","Axis",4,4,7,0,6,2,1,0,1,1850,"Ted","None,None,None",8,873.33333333333326,"H Ted Buehring",673.33333333333326]
["Rick Whitsell","Jamaica","Allied",2,2.5,0,1,1,0,1,0,0,50,"Rick","None,None,None",6,1128,"Rick Whitsell",1128]
["Gary Powell","Des Moines","Allied",3,3.5,0,0,0,0,0,0,0,0,"Gary","None,None,None",3.5,658,"Gary Powell",658]