{"text_format":"1","workbook":"xlsx","n_sheets":51,"sheets":["Von","ScoreList","BattleSummary","Nats Awards","Potential Cap List","Captains","Master","Campaign Master","MI July Sat 1","MI July Sat 2","MI July Sat 3","NY Aug Sat 1","NY Aug Sat 2","MN Aug Sat 1","MN Sept Fri 1","MN Sept Sat 1","MN Sept Sat 2","MN Sept Sat 3","MN Sept Sun 1","MN Sept Sun 2","NJ Oct Fri 1","NJ Oct Fri 2","NJ Oct Sat 1","NJ Oct Sat 2","NJ Oct  Sat 3","NJ Oct Sun 1","GA Feb Sat 1","GA Feb Sat 2","GA Feb Sun 1","GA Feb SUN 2","GA Feb SUN 3","GA Feb Mon 1","MN May Sat 1","MN May Sat 2","MN May Sat 3","MN May Sun 1","MN May Sun 2","NJ May Fri 1","NJ May Fri 2","NJ May Sat 1","NJ May Sat 2","NJ May Sun 1","NC June Mon 1","NC June Mon 2","NC June Tues 1","NC June Tues Campaign","NC June Wed 1","NC June Wed 2","NC June Thurs 1","NC June Thurs Campaign","Instructions"],"not_rendered":{"charts":0,"images":15,"macros":1,"external_links":0,"defined_names":52,"comments":0,"pivot_tables":1},"unopened":[],"bounds":{"document_bytes":16777216,"sheet_cells":100000,"rows_first":2000,"rows_last":500,"rows_between":2000,"halvings":0,"cell_chars":16384,"cell_head_chars":4096},"cells_cut":0,"cells_raw":0,"read":"whole","date_system":"1900"}

{"sheet":"Von","index":0,"n_rows":66,"n_cols":5,"rows_kept":66,"cut":false,"hidden":false,"merged":[]}
["Row Labels","Sum of Score",null,null,"List of Battles"]
["Green",68500,null,null,"NY Aug"]
["Orange",57750,null,null,"MN Sept"]
["Kevin Plumer",38827.38064215245,null,null,"MI July"]
["Bob Hoernemann",25690.924970865519,null,null,"MN Aug"]
["William Tustin",25682.206429134872,null,null,"NJ Oct"]
["Andy Terpstra",25257.909679363864,null,null,"NJ Oct "]
["Robert Arena",22816.278492658235,null,null,"NJ Oct"]
["Steve Andrews",22672.915805326142,null,null,"GA Feb"]
["Tom Palmer",22438.808639711071,null,null,"MN May"]
["Richard Whitsell",22240.285398962391,null,null,"NJ May"]
["Matt Andrews",22070.398441564346,null,null,"NC June"]
["McCoy Helland",21429.837481085826]
["Owen Ronning",19382.069696674538]
["Tyler Helland",17818.239452865015]
["Justin Ragucci",17499.61748384649]
["Brian Koehler",17022.465679409077]
["Zach Hoernemann",16430.155783040329]
["Ken Arena",14954.570527741602]
["Kevin Sundberg",14334.49185067801]
["Peter Ellison",13539.939192486525]
["Thomas Tanner",13501.632889445829]
["Nathan Armstrong",12983.040170036644]
["Matthew Larson",12824.983639203236]
["Neil Humble",12499.812206401844]
["Mike Smith",12320.938255980171]
["Ginger Andrews",10906.157540734075]
["Glenn Brandon",10329.662108339769]
["Matthew Moury",9714.9927151156335]
["Bryan Box",9337.1052631957737]
["Caleb Smith",9199.5036145004888]
["William Harvard",9033.8307692307699]
["Lou Meszaros",8748.5505776556838]
["Kevin Bray",7364.4088470762972]
["Eric Bitondo",7032.2185230873438]
["Mattie Vezquez",6857.6559606807559]
["Cameron Hunt",6296.4315613602857]
["Chris Pearce",5599.3333968448715]
["Brian Lamb",5443.5771003443224]
["Chris Grossaint",5243.5771003443224]
["Timothy Beckett",5243.5771003443224]
["Matthew Larsen",5214.6681870477214]
["Adderley Helland",5018.103174603174]
["Cameron Moury",4672.2813629707362]
["Carl Bitondo",4623.8079205834329]
["Mark Roe",4621.416666666667]
["Brandon Smith",4346.969696969697]
["Jacen Winette",4253.7085137085141]
["Peter Eillison",4095.9044580680829]
["Mark Kuntz",3091.1032910137128]
["Ron Hunt",3011.9177625973107]
["Mati Velzquez",2974.2142581245253]
["Etta Helland",2426.0057471264367]
["Ken Kelly",2177.4308401377289]
["Kas Gaigalas",2060]
["David Winette",1973.7012987012986]
["Ryan Szimanski",1960.2941176470588]
["Samantha Fowler",1936.5833333333333]
["Emilio Ragucci",1754.3794871794871]
["Amanda Seltzer",1724.8663594470045]
["Carl Camurati",1633.6585365853659]
["Evan Fowler",1499.6470588235293]
["Hazel Koehler",767.5]
["Craig Singer",482.35294117647061]
["(blank)"]
["Grand Total",753160.00000000023]

{"sheet":"ScoreList","index":1,"n_rows":524,"n_cols":10,"rows_kept":524,"cut":false,"hidden":false,"merged":[]}
["Event ID","Battle ID","Battle Type","Captain","Class","Score","Damage","Sink","All Sorties","Individual Pts"]
["NY Aug","Sat 1","Fleet","Matt Andrews",5,-397.3170731707317,540,0,0]
["NY Aug","Sat 1","Fleet","Robert Arena",5,996.47058823529414,1490,1,1]
["NY Aug","Sat 1","Fleet","Ginger Andrews",3,930.58823529411757,0,0,1]
["NY Aug","Sat 1","Fleet","Justin Ragucci",5,1196.4705882352941,470,0,1]
["NY Aug","Sat 1","Fleet","Thomas Tanner",4,693.65853658536594,2090,1,1]
["NY Aug","Sat 1","Fleet","Steve Andrews",5,1196.4705882352941,330,0,1]
["NY Aug","Sat 1","Fleet","Carl Camurati",4,693.65853658536594,1890,1,1]
["NY Aug","Sat 2","Fleet","Justin Ragucci",5,1527.3529411764705,440,0,1]
["NY Aug","Sat 2","Fleet","Thomas Tanner",4,940,2930,1,1]
["NY Aug","Sat 2","Fleet","Robert Arena",5,1527.3529411764705,700,0,1]
["NY Aug","Sat 2","Fleet","Ginger Andrews",3,1187.9411764705883,30,0,1]
["NY Aug","Sat 2","Fleet","Steve Andrews",5,1527.3529411764705,1110,0,1]
["NY Aug","Sat 2","Fleet","Carl Camurati",4,940,2840,2,1]
["MN Sept","Fri 1","Fleet","Peter Ellison",4,710.30303030303037,1150,0,1]
["MN Sept","Fri 1","Fleet","Bob Hoernemann",6,887.87878787878788,1310,0,1]
["MN Sept","Fri 1","Fleet","Brandon Smith",4,510.30303030303037,2970,1,1]
["MN Sept","Fri 1","Fleet","Zach Hoernemann",3,621.5151515151515,840,0,1]
["MN Sept","Fri 1","Fleet","Richard Whitsell",2,1175.625,30,0,1]
["MN Sept","Fri 1","Fleet","Tom Palmer",4,1567.5,950,0,1]
["MN Sept","Fri 1","Fleet","Owen Ronning",4,1567.5,890,0,1]
["MN Sept","Fri 1","Fleet","Andy Terpstra",6,1959.375,1060,0,1]
["MN Sept","Sat 1","Fleet","McCoy Helland",4,1491.6666666666665,580,0,1]
["MN Sept","Sat 1","Fleet","Bob Hoernemann",6,1864.5833333333335,880,0,1]
["MN Sept","Sat 1","Fleet","Tom Palmer",4,1491.6666666666665,1700,0,1]
["MN Sept","Sat 1","Fleet","Brandon Smith",4,1491.6666666666665,500,0,1]
["MN Sept","Sat 1","Fleet","Owen Ronning",4,1491.6666666666665,2160,0,1]
["MN Sept","Sat 1","Fleet","Richard Whitsell",2,1118.75,0,0,1]
["MN Sept","Sat 1","Fleet","Andy Terpstra",6,1531.578947368421,1620,0,1]
["MN Sept","Sat 1","Fleet","Tyler Helland",4,1025.2631578947369,3150,2,1]
["MN Sept","Sat 1","Fleet","Matthew Larson",4,612.63157894736844,480,0,0]
["MN Sept","Sat 1","Fleet","Mike Smith",4,1225.2631578947369,1760,0,1]
["MN Sept","Sat 1","Fleet","Peter Ellison",4,1225.2631578947369,1940,0,1]
["MN Sept","Sat 2","Fleet","Owen Ronning",4,1226.6666666666665,960,0,1]
["MN Sept","Sat 2","Fleet","Tom Palmer",4,1226.6666666666665,1220,0,1]
["MN Sept","Sat 2","Fleet","Richard Whitsell",2,920,50,0,1]
["MN Sept","Sat 2","Fleet","Bob Hoernemann",6,1533.3333333333335,890,0,1]
["MN Sept","Sat 2","Fleet","McCoy Helland",4,1226.6666666666665,940,0,1]
["MN Sept","Sat 2","Fleet","Brandon Smith",4,1226.6666666666665,1760,0,1]
["MN Sept","Sat 2","Fleet","Tyler Helland",4,950.20408163265301,1000,0,1]
["MN Sept","Sat 2","Fleet","Mike Smith",4,950.20408163265301,1080,0,1]
["MN Sept","Sat 2","Fleet","Andy Terpstra",6,1187.7551020408164,1670,0,1]
["MN Sept","Sat 2","Fleet","Peter Ellison",4,750.20408163265301,3090,1,1]
["MN Sept","Sat 2","Fleet","Adderley Helland",3,831.42857142857133,50,0,1]
["MN Sept","Sat 2","Fleet","Matthew Larson",4,950.20408163265301,470,0,1]
["MN Sept","Sat 3","Fleet","Richard Whitsell",2,838.75,90,0,1]
["MN Sept","Sat 3","Fleet","Bob Hoernemann",6,1397.9166666666667,1690,0,1]
["MN Sept","Sat 3","Fleet","Brandon Smith",4,1118.3333333333333,830,0,1]
["MN Sept","Sat 3","Fleet","Owen Ronning",4,918.33333333333326,1970,1,1]
["MN Sept","Sat 3","Fleet","Tom Palmer",4,1118.3333333333333,980,0,1]
["MN Sept","Sat 3","Fleet","McCoy Helland",4,1118.3333333333333,1120,0,1]
["MN Sept","Sat 3","Fleet","Adderley Helland",3,954.28571428571422,170,0,1]
["MN Sept","Sat 3","Fleet","Tyler Helland",4,890.61224489795904,1920,1,1]
["MN Sept","Sat 3","Fleet","Andy Terpstra",6,1363.2653061224489,2210,0,1]
["MN Sept","Sat 3","Fleet","Peter Ellison",4,1090.612244897959,1280,0,1]
["MN Sept","Sat 3","Fleet","Matthew Larson",4,1090.612244897959,300,0,1]
["MN Sept","Sat 3","Fleet","Mike Smith",4,1090.612244897959,830,0,1]
["MN Sept","Sun 1","Fleet","Bob Hoernemann",6,2512.5,1090,0,1]
["MN Sept","Sun 1","Fleet","McCoy Helland",4,2010,1030,0,1]
["MN Sept","Sun 1","Fleet","Glenn Brandon",4,2010,1550,0,1]
["MN Sept","Sun 1","Fleet","Richard Whitsell",2,1507.5,30,0,1]
["MN Sept","Sun 1","Fleet","Tom Palmer",4,2010,1800,0,1]
["MN Sept","Sun 1","Fleet","Andy Terpstra",6,982.14285714285711,810,0,1]
["MN Sept","Sun 1","Fleet","Owen Ronning",4,585.71428571428567,2900,1,1]
["MN Sept","Sun 1","Fleet","Tyler Helland",4,585.71428571428567,3440,2,1]
["MN Sept","Sun 1","Fleet","Matthew Larson",4,785.71428571428567,350,0,1]
["MN Sept","Sun 1","Fleet","Etta Helland",3,487.5,1260,1,1]
["MN Sept","Sun 1","Fleet","Adderley Helland",3,687.5,270,0,1]
["MN Sept","Sun 1","Fleet","Peter Ellison",4,785.71428571428567,1020,0,1]
["MN Sept","Sun 2","Fleet","Owen Ronning",4,1254.2222222222222,2850,1,1]
["MN Sept","Sun 2","Fleet","McCoy Helland",4,1454.2222222222222,1020,0,1]
["MN Sept","Sun 2","Fleet","Tom Palmer",4,1454.2222222222222,1570,0,1]
["MN Sept","Sun 2","Fleet","Adderley Helland",3,1272.4444444444446,0,0,1]
["MN Sept","Sun 2","Fleet","Richard Whitsell",2,490.66666666666674,0,0,1]
["MN Sept","Sun 2","Fleet","Glenn Brandon",4,1454.2222222222222,460,0,1]
["MN Sept","Sun 2","Fleet","Andy Terpstra",6,1439.0243902439024,1590,0,1]
["MN Sept","Sun 2","Fleet","Peter Ellison",4,1151.219512195122,1650,0,1]
["MN Sept","Sun 2","Fleet","Etta Helland",3,807.31707317073176,2750,2,1]
["MN Sept","Sun 2","Fleet","Matthew Larson",4,951.21951219512198,1400,1,1]
["MN Sept","Sun 2","Fleet","Tyler Helland",4,1151.219512195122,790,0,1]
["MN Sept","Sun 2","Fleet","Owen Ronning",4,1254.2222222222222,2850,1,1]
["MN Sept","Sun 2","Fleet","McCoy Helland",4,1454.2222222222222,1020,0,1]
["MN Sept","Sun 2","Fleet","Tom Palmer",4,1454.2222222222222,1570,0,1]
["MN Sept","Sun 2","Fleet","Adderley Helland",3,1272.4444444444446,0,0,1]
["MN Sept","Sun 2","Fleet","Richard Whitsell",2,490.66666666666674,0,0,1]
["MN Sept","Sun 2","Fleet","Glenn Brandon",4,1454.2222222222222,460,0,1]
["MN Sept","Sun 2","Fleet","Andy Terpstra",6,1439.0243902439024,1590,0,1]
["MN Sept","Sun 2","Fleet","Peter Ellison",4,1151.219512195122,1650,0,1]
["MN Sept","Sun 2","Fleet","Etta Helland",3,807.31707317073176,2750,2,1]
["MN Sept","Sun 2","Fleet","Matthew Larson",4,951.21951219512198,1400,1,1]
["MN Sept","Sun 2","Fleet","Tyler Helland",4,1151.219512195122,790,0,1]
["MI July","Sat 1","Fleet","Samantha Fowler",3,1181.25,930,0,1]
["MI July","Sat 1","Fleet","Evan Fowler",5,874,2690,2,1]
["MI July","Sat 1","Fleet","Mark Roe",5,1518.75,860,0,1]
["MI July","Sat 1","Fleet","Kas Gaigalas",2,716,10,0,1]
["MI July","Sat 2","Fleet","Samantha Fowler",3,275.33333333333331,160,0,1]
["MI July","Sat 2","Fleet","Mark Roe",4,314.66666666666669,420,0,1]
["MI July","Sat 2","Fleet","Kas Gaigalas",2,232,0,0,1]
["MI July","Sat 2","Fleet","Evan Fowler",5,348,590,0,1]
["MI July","Sat 3","Individual","Mark Roe",4,1120,480,0,1,640]
["MI July","Sat 3","Individual","Samantha Fowler",3,480,1120,0,1,0]
["MN Aug","Sat 1","Fleet","Mark Roe",5,1668,1160,0,1]
["MN Aug","Sat 1","Fleet","Kas Gaigalas",2,1112,0,0,1]
["MN Aug","Sat 1","Fleet","Craig Singer",6,482.35294117647061,1520,1,1]
["MN Aug","Sat 1","Fleet","Evan Fowler",3,277.64705882352939,1260,1,1]
["NJ Oct","Fri 1","Fleet","Richard Whitsell",2,957.5,30,0,1]
["NJ Oct","Fri 1","Fleet","Kevin Plumer",4,1076.6666666666665,3140,1,1]
["NJ Oct","Fri 1","Fleet","Justin Ragucci",5,2467.894736842105,1640,0,1]
["NJ Oct","Fri 1","Fleet","William Tustin",6,2742.1052631578946,2190,0,1]
["NJ Oct","Fri 1","Fleet","Kevin Sundberg",6,1395.8333333333335,2040,1,1]
["NJ Oct","Fri 2","Fleet","William Tustin",6,2420.5128205128203,1590,0,1]
["NJ Oct","Fri 2","Fleet","Kevin Sundberg",6,1255.5555555555557,2500,1,1]
["NJ Oct","Fri 2","Fleet","Kevin Plumer",4,1164.4444444444443,2220,0,1]
["NJ Oct","Fri 2","Fleet","Emilio Ragucci",3,847.17948717948718,840,1,0]
["NJ Oct","Fri 2","Fleet","Richard Whitsell",2,1452.3076923076924,190,0,1]
["NJ Oct","Sat 1","Fleet","William Tustin",6,2810.7142857142858,1180,0,1]
["NJ Oct","Sat 1","Fleet","Matt Andrews",5,759.21052631578937,2830,1,1]
["NJ Oct","Sat 1","Fleet","Justin Ragucci",5,2529.6428571428573,880,0,1]
["NJ Oct","Sat 1","Fleet","Kevin Sundberg",6,-467.1052631578948,650,0,0]
["NJ Oct","Sat 1","Fleet","Ken Arena",5,759.21052631578937,2030,1,1]
["NJ Oct","Sat 1","Fleet","Robert Arena",5,759.21052631578937,2140,1,1]
["NJ Oct","Sat 1","Fleet","Richard Whitsell",2,639.47368421052624,220,0,1]
["NJ Oct","Sat 1","Fleet","Kevin Plumer",5,2529.6428571428573,1990,0,1]
["NJ Oct","Sat 2","Fleet","William Tustin",6,2592,910,0,1]
["NJ Oct","Sat 2","Fleet","Ken Arena",5,845.94594594594605,2760,2,1]
["NJ Oct","Sat 2","Fleet","Matt Andrews",5,2332.7999999999997,1090,0,1]
["NJ Oct","Sat 2","Fleet","Kevin Plumer",5,845.94594594594605,2860,1,1]
["NJ Oct","Sat 2","Fleet","Robert Arena",5,845.94594594594605,2120,1,1]
["NJ Oct","Sat 2","Fleet","Justin Ragucci",5,2332.7999999999997,1240,0,1]
["NJ Oct","Sat 2","Fleet","Emilio Ragucci",3,907.2,870,1,0]
["NJ Oct","Sat 2","Fleet","Richard Whitsell",2,1555.2,190,0,1]
["NJ Oct","Sat 2","Fleet","Kevin Sundberg",6,962.1621621621623,1980,1,1]
["NJ Oct ","Sat 3","Fleet","William Tustin",6,2555.8823529411766,1870,0,1]
["NJ Oct ","Sat 3","Fleet","Robert Arena",5,1023.5135135135135,2540,1,1]
["NJ Oct ","Sat 3","Fleet","Ken Arena",5,1023.5135135135135,1230,1,1]
["NJ Oct ","Sat 3","Fleet","Richard Whitsell",2,1533.5294117647061,120,0,1]
["NJ Oct ","Sat 3","Fleet","Justin Ragucci",5,2100.294117647059,2230,1,1]
["NJ Oct ","Sat 3","Fleet","Kevin Sundberg",6,1359.4594594594596,1170,0,1]
["NJ Oct ","Sat 3","Fleet","Matt Andrews",5,2300.294117647059,810,0,1]
["NJ Oct ","Sat 3","Fleet","Kevin Plumer",5,1023.5135135135135,3750,1,1]
["NJ Oct","Sun 1","Fleet","Kevin Sundberg",6,1335.593220338983,3020,1,1]
["NJ Oct","Sun 1","Fleet","William Tustin",6,2991.1111111111109,570,0,1]
["NJ Oct","Sun 1","Fleet","Ken Arena",5,1182.0338983050849,2480,2,1]
["NJ Oct","Sun 1","Fleet","Justin Ragucci",3,1046.8888888888889,790,1,0]
["NJ Oct","Sun 1","Fleet","Robert Arena",5,2492,3170,1,1]
["NJ Oct","Sun 1","Fleet","Richard Whitsell",2,921.3559322033899,10,0,1]
["NJ Oct","Sun 1","Fleet","Matt Andrews",5,691.01694915254245,1220,1,0]
["GA Feb","1 1","Fleet","Kevin Plumer",4,1009.6,880,0,1]
["GA Feb","1 1","Fleet","William Harvard",4,1009.6,30,0,1]
["GA Feb","1 1","Fleet","Bryan Box",3,883.40000000000009,160,0,1]
["GA Feb","1 1","Fleet","Brian Koehler",5,1135.8,650,0,1]
["GA Feb","1 1","Fleet","Neil Humble",4,1009.6,1340,0,1]
["GA Feb","1 1","Fleet","Steve Andrews",6,1262,400,0,1]
["GA Feb","1 1","Fleet","David Winette",6,898.70129870129858,460,1,1]
["GA Feb","1 1","Fleet","Jacen Winette",4,718.96103896103898,680,1,1]
["GA Feb","1 1","Fleet","Thomas Tanner",4,718.96103896103898,1820,1,1]
["GA Feb","1 1","Fleet","Lou Meszaros",4,318.96103896103898,2610,1,1]
["GA Feb","1 1","Fleet","Matt Andrews",5,-495.58441558441558,740,0,0]
["GA Feb","Sat 2","Fleet","Jacen Winette",4,1202.7272727272727,1050,1,0]
["GA Feb","Sat 2","Fleet","Jacen Winette",6,1503.4090909090908,490,0,0]
["GA Feb","Sat 2","Fleet","Thomas Tanner",4,2205.4545454545455,1380,1,1]
["GA Feb","Sat 2","Fleet","Matt Andrews",5,2706.136363636364,420,0,1]
["GA Feb","Sat 2","Fleet","Lou Meszaros",4,2405.4545454545455,1420,0,1]
["GA Feb","Sat 2","Fleet","Kevin Plumer",7,3006.8181818181815,2340,0,1]
["GA Feb","Sat 2","Fleet","Brian Koehler",5,1131.25,2090,1,1]
["GA Feb","Sat 2","Fleet","Neil Humble",5,1331.25,1430,0,1]
["GA Feb","Sat 2","Fleet","Steve Andrews",5,665.625,2250,1,0]
["GA Feb","Sat 2","Fleet","Bryan Box",3,517.70833333333337,1320,1,0]
["GA Feb","Sat 2","Fleet","William Harvard",4,1183.3333333333333,1000,0,1]
["GA Feb","Sat 2","Fleet","Carl Bitondo",3,835.41666666666674,2540,2,1]
["GA Feb","Sat 2","Fleet","Eric Bitondo",3,835.41666666666674,2600,2,1]
["GA Feb","Sun 1","Fleet","Thomas Tanner",4,1032.8888888888889,1090,0,1]
["GA Feb","Sun 1","Fleet","Steve Andrews",6,1291.1111111111111,2010,0,1]
["GA Feb","Sun 1","Fleet","Matt Andrews",5,1162,1540,0,1]
["GA Feb","Sun 1","Fleet","Brian Koehler",5,581,1750,1,0]
["GA Feb","Sun 1","Fleet","Jacen Winette",6,1291.1111111111111,1050,0,1]
["GA Feb","Sun 1","Fleet","Carl Bitondo",3,451.88888888888891,990,1,0]
["GA Feb","Sun 1","Fleet","Bryan Box",3,1229.375,340,0,1]
["GA Feb","Sun 1","Fleet","Eric Bitondo",3,1029.375,1630,1,1]
["GA Feb","Sun 1","Fleet","Nathan Armstrong",3,1229.375,340,0,1]
["GA Feb","Sun 1","Fleet","Kevin Plumer",7,1756.25,1220,0,1]
["GA Feb","Sun 1","Fleet","Neil Humble",5,1580.625,1760,0,1]
["GA Feb","Sun 1","Fleet","William Harvard",4,1405,520,0,1]
["GA Feb","SUN 2","Fleet","Kevin Plumer",7,2133.3333333333335,1750,0,1]
["GA Feb","SUN 2","Fleet","Eric Bitondo",3,1293.3333333333335,1270,1,1]
["GA Feb","SUN 2","Fleet","Bryan Box",3,1493.3333333333335,300,0,1]
["GA Feb","SUN 2","Fleet","William Harvard",4,1706.6666666666665,1420,0,1]
["GA Feb","SUN 2","Fleet","Nathan Armstrong",3,1493.3333333333335,500,0,1]
["GA Feb","SUN 2","Fleet","Neil Humble",5,1920,1640,0,1]
["GA Feb","SUN 2","Fleet","David Winette",6,1075,1170,0,1]
["GA Feb","SUN 2","Fleet","Steve Andrews",6,1075,1740,0,1]
["GA Feb","SUN 2","Fleet","Matt Andrews",5,967.5,470,0,1]
["GA Feb","SUN 2","Fleet","Lou Meszaros",4,660,1330,1,1]
["GA Feb","SUN 2","Fleet","Jacen Winette",6,-462.5,1090,0,0]
["GA Feb","SUN 2","Fleet","Hazel Koehler",5,767.5,3040,1,1]
["GA Feb","SUN 2","Fleet","Brian Koehler",2,645,80,0,1]
["GA Feb","SUN 2","Fleet","Carl Bitondo",3,552.5,1320,1,1]
["GA Feb","SUN 3","Fleet","Nathan Armstrong",3,1419.25,110,0,1]
["GA Feb","SUN 3","Fleet","Neil Humble",5,1824.75,1440,0,1]
["GA Feb","SUN 3","Fleet","Kevin Plumer",7,2027.5,1710,0,1]
["GA Feb","SUN 3","Fleet","Bryan Box",3,1419.25,650,0,1]
["GA Feb","SUN 3","Fleet","Eric Bitondo",3,1219.25,1180,1,1]
["GA Feb","SUN 3","Fleet","Brian Koehler",2,848.33333333333326,350,0,1]
["GA Feb","SUN 3","Fleet","Carl Bitondo",3,989.72222222222229,650,0,1]
["GA Feb","SUN 3","Fleet","Lou Meszaros",4,565.55555555555554,2150,1,0]
["GA Feb","SUN 3","Fleet","Steve Andrews",6,1213.8888888888889,4210,1,1]
["GA Feb","SUN 3","Fleet","Matt Andrews",5,1272.5,750,0,1]
["GA Feb","Mon 1","Fleet","Steve Andrews",3,696,2350,1,1]
["GA Feb","Mon 1","Fleet","Matt Andrews",5,952,2770,1,1]
["GA Feb","Mon 1","Fleet","Brian Koehler",2,768,130,0,1]
["GA Feb","Mon 1","Fleet","Lou Meszaros",4,1024,810,0,1]
["GA Feb","Mon 1","Fleet","Nathan Armstrong",4,1864.6153846153848,700,0,1]
["GA Feb","Mon 1","Fleet","William Harvard",4,1864.6153846153848,830,0,1]
["GA Feb","Mon 1","Fleet","Kevin Plumer",7,2330.7692307692309,2310,0,1]
["GA Feb","Mon 1","Fleet","Steve Andrews",3,696,2350,1,1]
["GA Feb","Mon 1","Fleet","Matt Andrews",5,952,2770,1,1]
["GA Feb","Mon 1","Fleet","Brian Koehler",2,768,130,0,1]
["GA Feb","Mon 1","Fleet","Lou Meszaros",4,1024,810,0,1]
["GA Feb","Mon 1","Fleet","Nathan Armstrong",4,1864.6153846153848,700,0,1]
["GA Feb","Mon 1","Fleet","William Harvard",4,1864.6153846153848,830,0,1]
["GA Feb","Mon 1","Fleet","Kevin Plumer",7,2330.7692307692309,2310,0,1]
["MN May","Sat 1","Fleet","Glenn Brandon",4,1537.4545454545453,780,0,1]
["MN May","Sat 1","Fleet","Bob Hoernemann",6,1921.818181818182,1630,0,1]
["MN May","Sat 1","Fleet","Peter Ellison",4,1537.4545454545453,730,0,1]
["MN May","Sat 1","Fleet","Richard Whitsell",2,576.5454545454545,650,1,0]
["MN May","Sat 1","Fleet","Owen Ronning",4,1337.4545454545453,1330,1,1]
["MN May","Sat 1","Fleet","Matthew Larson",4,1537.4545454545453,410,0,1]
["MN May","Sat 1","Fleet","Zach Hoernemann",6,1921.818181818182,1390,0,1]
["MN May","Sat 1","Fleet","McCoy Helland",5,1073.7931034482758,1890,0,1]
["MN May","Sat 1","Fleet","Tom Palmer",4,754.48275862068965,2230,1,1]
["MN May","Sat 1","Fleet","Andy Terpstra",6,1193.1034482758621,2690,0,1]
["MN May","Sat 1","Fleet","Mike Smith",4,754.48275862068965,1310,1,1]
["MN May","Sat 1","Fleet","Etta Helland",3,635.17241379310349,1130,1,1]
["MN May","Sat 1","Fleet","Tyler Helland",5,1073.7931034482758,1100,0,1]
["MN May","Sat 1","Fleet","Chris Pearce",3,835.17241379310349,220,0,1]
["MN May","Sat 2","Fleet","Peter Ellison",4,1437.2413793103449,550,0,1]
["MN May","Sat 2","Fleet","Bob Hoernemann",6,1796.5517241379312,1370,0,1]
["MN May","Sat 2","Fleet","Matthew Larson",4,1237.2413793103449,1280,1,1]
["MN May","Sat 2","Fleet","Richard Whitsell",2,1077.9310344827586,40,0,1]
["MN May","Sat 2","Fleet","Zach Hoernemann",6,1796.5517241379312,1270,0,1]
["MN May","Sat 2","Fleet","Glenn Brandon",4,1437.2413793103449,680,0,1]
["MN May","Sat 2","Fleet","Owen Ronning",4,1237.2413793103449,1640,1,1]
["MN May","Sat 2","Fleet","Andy Terpstra",6,1110.5691056910568,1540,0,1]
["MN May","Sat 2","Fleet","Mike Smith",4,688.45528455284557,2320,1,1]
["MN May","Sat 2","Fleet","Chris Pearce",3,577.39837398373982,850,1,1]
["MN May","Sat 2","Fleet","Tom Palmer",4,888.45528455284557,1600,0,1]
["MN May","Sat 2","Fleet","Kevin Bray",4,888.45528455284557,20,0,1]
["MN May","Sat 2","Fleet","Tyler Helland",4,688.45528455284557,2900,2,1]
["MN May","Sat 2","Fleet","McCoy Helland",5,999.51219512195121,830,0,1]
["MN May","Sat 2","Fleet","Etta Helland",3,-311.30081300813009,360,0,0]
["MN May","Sat 3","Fleet","Richard Whitsell",2,1411.304347826087,40,0,1]
["MN May","Sat 3","Fleet","Matthew Larson",4,1881.7391304347825,740,0,1]
["MN May","Sat 3","Fleet","Tom Palmer",4,1881.7391304347825,1360,0,1]
["MN May","Sat 3","Fleet","Bob Hoernemann",6,2352.173913043478,1400,0,1]
["MN May","Sat 3","Fleet","Andy Terpstra",6,2152.173913043478,3350,1,1]
["MN May","Sat 3","Fleet","Glenn Brandon",4,140.86956521739125,580,0,0]
["MN May","Sat 3","Fleet","McCoy Helland",5,1139.4915254237289,1540,0,1]
["MN May","Sat 3","Fleet","Tyler Helland",4,812.88135593220341,2000,1,1]
["MN May","Sat 3","Fleet","Peter Ellison",4,1012.8813559322034,800,0,1]
["MN May","Sat 3","Fleet","Zach Hoernemann",6,1266.1016949152543,1570,0,1]
["MN May","Sat 3","Fleet","Kevin Bray",4,1012.8813559322034,310,0,1]
["MN May","Sat 3","Fleet","Owen Ronning",4,812.88135593220341,1640,1,1]
["MN May","Sat 3","Fleet","Mike Smith",4,812.88135593220341,2960,2,1]
["MN May","Sun 1","Fleet","Glenn Brandon",4,1135.6521739130435,520,0,1]
["MN May","Sun 1","Fleet","Richard Whitsell",2,851.73913043478262,40,0,1]
["MN May","Sun 1","Fleet","Tom Palmer",4,1135.6521739130435,1550,0,1]
["MN May","Sun 1","Fleet","Peter Ellison",4,567.82608695652175,1270,0,0]
["MN May","Sun 1","Fleet","Zach Hoernemann",6,1419.5652173913043,1300,0,1]
["MN May","Sun 1","Fleet","Bob Hoernemann",6,1419.5652173913043,1900,0,1]
["MN May","Sun 1","Fleet","Kevin Bray",4,1108.2105263157894,230,0,1]
["MN May","Sun 1","Fleet","Chris Pearce",3,484.84210526315786,790,1,0]
["MN May","Sun 1","Fleet","Matthew Larson",4,908.21052631578937,1240,1,1]
["MN May","Sun 1","Fleet","McCoy Helland",5,1246.7368421052631,1580,0,1]
["MN May","Sun 1","Fleet","Tyler Helland",5,1246.7368421052631,1140,0,1]
["MN May","Sun 1","Fleet","Andy Terpstra",6,1385.2631578947369,1550,0,1]
["MN May","Sun 2","Fleet","Peter Ellison",4,2120,2350,1,1]
["MN May","Sun 2","Fleet","Richard Whitsell",2,1740,10,0,1]
["MN May","Sun 2","Fleet","Glenn Brandon",4,1160,1640,1,0]
["MN May","Sun 2","Fleet","Mike Smith",4,1160,1160,0,0]
["MN May","Sun 2","Fleet","Zach Hoernemann",6,2700,2810,1,1]
["MN May","Sun 2","Fleet","Tom Palmer",4,2120,2470,1,1]
["MN May","Sun 2","Fleet","Bob Hoernemann",6,2900,2140,0,1]
["MN May","Sun 2","Fleet","Matthew Larson",4,1918.7368421052629,2180,2,1]
["MN May","Sun 2","Fleet","Tyler Helland",5,291.78947368421063,700,0,0]
["MN May","Sun 2","Fleet","McCoy Helland",5,2383.5789473684213,1580,0,1]
["MN May","Sun 2","Fleet","Tyler Helland",4,1918.7368421052629,2740,2,1]
["MN May","Sun 2","Fleet","Owen Ronning",4,1918.7368421052629,3260,2,1]
["MN May","Sun 2","Fleet","Andy Terpstra",6,2448.4210526315787,4040,1,1]
["NJ May","Fri 1","Fleet","William Tustin",5,1670.5617977528088,2280,1,0]
["NJ May","Fri 1","Fleet","Steve Andrews",6,1856.1797752808989,550,0,0]
["NJ May","Fri 1","Fleet","Kevin Plumer",7,3712.3595505617977,3370,0,1]
["NJ May","Fri 1","Fleet","Brian Koehler",5,3141.1235955056177,1600,1,1]
["NJ May","Fri 1","Fleet","Matthew Moury",4,2969.8876404494381,690,0,1]
["NJ May","Fri 1","Fleet","Mattie Vezquez",4,2769.8876404494381,2110,1,1]
["NJ May","Fri 1","Fleet","Ginger Andrews",3,1386.9158878504672,270,0,1]
["NJ May","Fri 1","Fleet","Thomas Tanner",4,1385.0467289719625,1980,1,1]
["NJ May","Fri 1","Fleet","Caleb Smith",5,1583.1775700934579,5240,1,1]
["NJ May","Fri 1","Fleet","Robert Arena",5,1583.1775700934579,3670,2,1]
["NJ May","Fri 1","Fleet","Justin Ragucci",3,1186.9158878504672,910,1,1]
["NJ May","Fri 1","Fleet","Ken Arena",5,1583.1775700934579,2300,2,1]
["NJ May","Fri 1","Fleet","Matt Andrews",5,891.58878504672896,2150,1,0]
["NJ May","Fri 2","Fleet","Kevin Plumer",4,1568.2352941176471,1430,0,1]
["NJ May","Fri 2","Fleet","Ryan Szimanski",7,1960.2941176470588,1950,0,1]
["NJ May","Fri 2","Fleet","Steve Andrews",6,1960.2941176470588,1300,0,1]
["NJ May","Fri 2","Fleet","Mattie Vezquez",4,1368.2352941176471,990,1,1]
["NJ May","Fri 2","Fleet","William Tustin",5,1564.2647058823529,1970,1,1]
["NJ May","Fri 2","Fleet","Matthew Moury",4,784.11764705882354,420,0,0]
["NJ May","Fri 2","Fleet","Nathan Armstrong",6,1260.2941176470588,620,0,1]
["NJ May","Fri 2","Fleet","Brian Koehler",5,1764.2647058823529,480,0,1]
["NJ May","Fri 2","Fleet","Ginger Andrews",3,1282.4000000000001,160,0,1]
["NJ May","Fri 2","Fleet","Robert Arena",5,1448.8,2860,2,1]
["NJ May","Fri 2","Fleet","Matt Andrews",4,1265.6000000000001,2420,1,1]
["NJ May","Fri 2","Fleet","Ken Arena",5,1448.8,2270,2,1]
["NJ May","Fri 2","Fleet","Caleb Smith",5,1448.8,4200,1,1]
["NJ May","Fri 2","Fleet","Thomas Tanner",4,1465.6000000000001,1420,0,1]
["NJ May","Sat 1","Fleet","Ginger Andrews",3,1298.0882352941176,40,0,1]
["NJ May","Sat 1","Fleet","Matt Andrews",5,1468.9705882352941,1740,1,1]
["NJ May","Sat 1","Fleet","Ken Arena",5,1668.9705882352941,780,0,1]
["NJ May","Sat 1","Fleet","Robert Arena",5,1468.9705882352941,2970,1,1]
["NJ May","Sat 1","Fleet","Kevin Plumer",7,1854.4117647058824,570,0,1]
["NJ May","Sat 1","Fleet","Justin Ragucci",3,1298.0882352941176,40,0,1]
["NJ May","Sat 1","Fleet","Caleb Smith",5,1668.9705882352941,1350,0,1]
["NJ May","Sat 1","Fleet","Thomas Tanner",4,1083.5294117647059,1210,0,1]
["NJ May","Sat 1","Fleet","Mattie Vezquez",4,1122.5806451612902,290,0,1]
["NJ May","Sat 1","Fleet","Matthew Moury",4,922.58064516129025,1780,2,1]
["NJ May","Sat 1","Fleet","Steve Andrews",6,1403.2258064516129,960,0,1]
["NJ May","Sat 1","Fleet","Brian Koehler",5,1262.9032258064517,1340,0,1]
["NJ May","Sat 1","Fleet","Amanda Seltzer",4,1122.5806451612902,1120,0,1]
["NJ May","Sat 1","Fleet","William Tustin",5,1062.9032258064517,4260,2,1]
["NJ May","Sat 1","Fleet","Kevin Sundberg",6,1203.2258064516129,2860,1,1]
["NJ May","Sat 2","Fleet","Ken Arena",5,2331.3461538461538,420,0,1]
["NJ May","Sat 2","Fleet","Robert Arena",5,2331.3461538461538,790,0,1]
["NJ May","Sat 2","Fleet","Kevin Plumer",7,2590.3846153846157,1750,0,1]
["NJ May","Sat 2","Fleet","Thomas Tanner",4,2072.3076923076924,1010,0,1]
["NJ May","Sat 2","Fleet","Justin Ragucci",3,1813.2692307692307,390,0,1]
["NJ May","Sat 2","Fleet","Caleb Smith",5,2331.3461538461538,910,0,1]
["NJ May","Sat 2","Fleet","Amanda Seltzer",4,602.28571428571422,420,0,1]
["NJ May","Sat 2","Fleet","Steve Andrews",6,-247.14285714285722,960,0,1]
["NJ May","Sat 2","Fleet","Kevin Sundberg",6,552.85714285714278,3550,1,1]
["NJ May","Sat 2","Fleet","William Tustin",5,477.57142857142856,2200,1,1]
["NJ May","Sat 2","Fleet","Brian Koehler",5,477.57142857142856,2570,1,1]
["NJ May","Sat 2","Fleet","Matt Andrews",4,602.28571428571422,420,0,1]
["NJ May","Sat 2","Fleet","Matthew Moury",4,402.28571428571422,1990,1,1]
["NJ May","Sat 2","Fleet","Mattie Vezquez",4,402.28571428571422,1360,1,1]
["NJ May","Sun 1","Fleet","Caleb Smith",5,2167.2093023255816,2980,1,1]
["NJ May","Sun 1","Fleet","Ginger Andrews",3,1841.1627906976746,40,0,1]
["NJ May","Sun 1","Fleet","Robert Arena",5,2367.2093023255816,790,0,1]
["NJ May","Sun 1","Fleet","Thomas Tanner",4,1904.1860465116279,360,0,1]
["NJ May","Sun 1","Fleet","Kevin Plumer",7,2630.2325581395348,2550,0,1]
["NJ May","Sun 1","Fleet","Matthew Moury",4,994.66666666666674,2020,2,1]
["NJ May","Sun 1","Fleet","Steve Andrews",6,1293.3333333333333,3420,1,1]
["NJ May","Sun 1","Fleet","Mattie Vezquez",4,1194.6666666666667,700,0,1]
["NJ May","Sun 1","Fleet","William Tustin",5,1344,2220,0,1]
["NJ May","Sun 1","Fleet","Kevin Sundberg",6,1493.3333333333333,2950,0,1]
["NC June","Mon 1","Fleet","Brian Koehler",5,1268.4563758389263,1610,0,1]
["NC June","Mon 1","Fleet","Neil Humble",5,1268.4563758389263,650,0,1]
["NC June","Mon 1","Fleet","Kevin Bray",4,1127.5167785234898,470,0,1]
["NC June","Mon 1","Fleet","Timothy Beckett",6,1209.3959731543623,1950,0,1]
["NC June","Mon 1","Fleet","Tyler Helland",5,1268.4563758389263,660,0,1]
["NC June","Mon 1","Fleet","McCoy Helland",5,1268.4563758389263,980,0,1]
["NC June","Mon 1","Fleet","Ken Kelly",1,563.75838926174492,170,0,1]
["NC June","Mon 1","Fleet","Lou Meszaros",5,-265.77181208053685,2210,0,0]
["NC June","Mon 1","Fleet","Richard Whitsell",2,845.63758389261739,170,0,1]
["NC June","Mon 1","Fleet","Kevin Sundberg",6,1409.3959731543623,2440,0,1]
["NC June","Mon 1","Fleet","William Tustin",5,634.22818791946315,2410,1,0]
["NC June","Mon 1","Fleet","Brian Lamb",6,1409.3959731543623,420,0,1]
["NC June","Mon 1","Fleet","Chris Pearce",4,1127.5167785234898,430,0,1]
["NC June","Mon 1","Fleet","Bryan Box",3,786.57718120805373,1040,1,1]
["NC June","Mon 1","Fleet","Matthew Larsen",4,1127.5167785234898,850,0,1]
["NC June","Mon 1","Fleet","Mark Kuntz",4,563.75838926174492,420,0,0]
["NC June","Mon 1","Fleet","Steve Andrews",6,1409.3959731543623,340,0,1]
["NC June","Mon 1","Fleet","Chris Grossaint",6,1409.3959731543623,1260,0,1]
["NC June","Mon 1","Fleet","Ken Arena",5,1268.4563758389263,1060,0,1]
["NC June","Mon 1","Fleet","Robert Arena",5,1176.3210702341137,1520,0,1]
["NC June","Mon 1","Fleet","Andy Terpstra",6,1307.0234113712374,890,0,1]
["NC June","Mon 1","Fleet","Bob Hoernemann",6,1307.0234113712374,1680,0,1]
["NC June","Mon 1","Fleet","Zach Hoernemann",6,1307.0234113712374,1110,0,1]
["NC June","Mon 1","Fleet","Peter Eillison",4,522.80936454849495,2300,1,0]
["NC June","Mon 1","Fleet","Peter Eillison",3,457.45819397993307,140,0,0]
["NC June","Mon 1","Fleet","Tom Palmer",6,1307.0234113712374,3110,0,1]
["NC June","Mon 1","Fleet","Ginger Andrews",3,914.91638795986614,230,0,1]
["NC June","Mon 1","Fleet","Kevin Plumer",7,1307.0234113712374,1720,0,1]
["NC June","Mon 1","Fleet","Nathan Armstrong",5,1176.3210702341137,450,0,1]
["NC June","Mon 1","Fleet","Owen Ronning",4,1045.6187290969899,910,0,1]
["NC June","Mon 1","Fleet","Matt Andrews",5,1176.3210702341137,440,0,1]
["NC June","Mon 1","Fleet","Cameron Moury",5,1176.3210702341137,640,0,1]
["NC June","Mon 1","Fleet","Ron Hunt",3,714.91638795986614,1530,1,1]
["NC June","Mon 1","Fleet","Cameron Hunt",6,1307.0234113712374,1750,0,1]
["NC June","Mon 1","Fleet","Matthew Moury",4,1045.6187290969899,140,0,1]
["NC June","Mon 1","Fleet","Mati Velzquez",4,1045.6187290969899,130,0,1]
["NC June","Mon 1","Fleet","Mike Smith",4,845.61872909698991,2310,1,1]
["NC June","Mon 2","Fleet","Cameron Moury",5,952.61016949152554,1730,1,1]
["NC June","Mon 2","Fleet","Andy Terpstra",6,1280.6779661016949,1440,0,1]
["NC June","Mon 2","Fleet","Mike Smith",4,924.54237288135596,590,0,1]
["NC June","Mon 2","Fleet","Zach Hoernemann",6,1280.6779661016949,1370,0,1]
["NC June","Mon 2","Fleet","Tom Palmer",6,1180.6779661016949,3370,0,1]
["NC June","Mon 2","Fleet","Owen Ronning",4,1024.542372881356,230,0,1]
["NC June","Mon 2","Fleet","Kevin Plumer",7,1280.6779661016949,3360,0,1]
["NC June","Mon 2","Fleet","Matt Andrews",4,1024.542372881356,700,0,1]
["NC June","Mon 2","Fleet","Bob Hoernemann",6,1280.6779661016949,1580,0,1]
["NC June","Mon 2","Fleet","Matthew Moury",4,1024.542372881356,500,0,1]
["NC June","Mon 2","Fleet","Mati Velzquez",4,824.54237288135596,870,1,1]
["NC June","Mon 2","Fleet","Ginger Andrews",3,896.47457627118649,40,0,1]
["NC June","Mon 2","Fleet","Robert Arena",5,1152.6101694915255,970,0,1]
["NC June","Mon 2","Fleet","Nathan Armstrong",5,576.30508474576277,1000,1,0]
["NC June","Mon 2","Fleet","Nathan Armstrong",3,448.23728813559325,0,0,0]
["NC June","Mon 2","Fleet","Peter Eillison",4,512.27118644067798,1150,1,0]
["NC June","Mon 2","Fleet","Peter Eillison",3,448.23728813559325,150,0,0]
["NC June","Mon 2","Fleet","Cameron Hunt",6,1280.6779661016949,1190,0,1]
["NC June","Mon 2","Fleet","Ron Hunt",3,196.47457627118649,650,0,1]
["NC June","Mon 2","Fleet","McCoy Helland",5,1228.8235294117646,2270,0,1]
["NC June","Mon 2","Fleet","Brian Lamb",6,1365.3594771241831,230,0,1]
["NC June","Mon 2","Fleet","Chris Pearce",4,1092.2875816993464,400,0,1]
["NC June","Mon 2","Fleet","Brian Koehler",5,1228.8235294117646,1690,0,1]
["NC June","Mon 2","Fleet","Chris Grossaint",6,1365.3594771241831,820,0,1]
["NC June","Mon 2","Fleet","Ken Arena",5,1228.8235294117646,180,0,1]
["NC June","Mon 2","Fleet","William Tustin",5,614.41176470588232,1660,1,0]
["NC June","Mon 2","Fleet","Mark Kuntz",4,892.28758169934645,1360,1,1]
["NC June","Mon 2","Fleet","Steve Andrews",6,1365.3594771241831,960,0,1]
["NC June","Mon 2","Fleet","Kevin Sundberg",6,1365.3594771241831,1440,0,1]
["NC June","Mon 2","Fleet","Kevin Bray",4,1092.2875816993464,260,0,1]
["NC June","Mon 2","Fleet","Lou Meszaros",5,614.41176470588232,2020,1,0]
["NC June","Mon 2","Fleet","Ken Kelly",1,546.14379084967322,90,0,1]
["NC June","Mon 2","Fleet","Richard Whitsell",2,819.21568627450984,150,0,1]
["NC June","Mon 2","Fleet","Timothy Beckett",6,1365.3594771241831,3010,0,1]
["NC June","Mon 2","Fleet","Tyler Helland",5,1228.8235294117646,730,0,1]
["NC June","Mon 2","Fleet","Matthew Larsen",4,1092.2875816993464,360,0,1]
["NC June","Mon 2","Fleet","Neil Humble",5,1228.8235294117646,880,0,1]
["NC June","Mon 2","Fleet","Bryan Box",3,955.75163398692803,380,0,1]
["NC June","Tues 1","Fleet","McCoy Helland",5,1226.6453674121406,670,0,1]
["NC June","Tues 1","Fleet","Richard Whitsell",2,817.76357827476033,130,0,1]
["NC June","Tues 1","Fleet","Tyler Helland",5,1226.6453674121406,440,0,1]
["NC June","Tues 1","Fleet","Matthew Larsen",2,817.76357827476033,0,0,1]
["NC June","Tues 1","Fleet","Chris Pearce",4,1090.3514376996804,580,0,1]
["NC June","Tues 1","Fleet","Kevin Bray",4,1090.3514376996804,1080,0,1]
["NC June","Tues 1","Fleet","Brian Lamb",6,1362.9392971246007,720,0,1]
["NC June","Tues 1","Fleet","Chris Grossaint",6,1162.9392971246007,1100,0,1]
["NC June","Tues 1","Fleet","William Tustin",5,1226.6453674121406,2020,0,1]
["NC June","Tues 1","Fleet","Mark Kuntz",4,790.35143769968045,2680,1,1]
["NC June","Tues 1","Fleet","Kevin Sundberg",6,1362.9392971246007,1360,0,1]
["NC June","Tues 1","Fleet","Timothy Beckett",6,1362.9392971246007,2280,0,1]
["NC June","Tues 1","Fleet","Steve Andrews",6,1362.9392971246007,690,0,1]
["NC June","Tues 1","Fleet","Neil Humble",5,326.64536741214056,780,0,1]
["NC June","Tues 1","Fleet","Bryan Box",3,477.02875399361022,1160,1,0]
["NC June","Tues 1","Fleet","Lou Meszaros",5,1226.6453674121406,1130,0,1]
["NC June","Tues 1","Fleet","Ken Arena",5,1026.6453674121406,1870,1,1]
["NC June","Tues 1","Fleet","Ken Kelly",1,545.17571884984022,210,0,1]
["NC June","Tues 1","Fleet","Brian Koehler",5,1026.6453674121406,1870,1,1]
["NC June","Tues 1","Fleet","Cameron Hunt",6,1380.0664451827245,700,0,1]
["NC June","Tues 1","Fleet","Tom Palmer",6,1180.0664451827245,1730,0,1]
["NC June","Tues 1","Fleet","Zach Hoernemann",6,1380.0664451827245,1160,0,1]
["NC June","Tues 1","Fleet","Bob Hoernemann",6,1380.0664451827245,1720,0,1]
["NC June","Tues 1","Fleet","Andy Terpstra",6,1380.0664451827245,1900,0,1]
["NC June","Tues 1","Fleet","Mike Smith",4,1104.0531561461794,680,0,1]
["NC June","Tues 1","Fleet","Owen Ronning",4,1104.0531561461794,790,0,1]
["NC June","Tues 1","Fleet","Peter Eillison",4,904.05315614617939,3160,1,1]
["NC June","Tues 1","Fleet","Mati Velzquez",4,1104.0531561461794,70,0,1]
["NC June","Tues 1","Fleet","Kevin Plumer",7,1180.0664451827245,1760,0,1]
["NC June","Tues 1","Fleet","Ron Hunt",3,766.04651162790697,1590,1,1]
["NC June","Tues 1","Fleet","Robert Arena",5,1242.0598006644518,210,0,1]
["NC June","Tues 1","Fleet","Matt Andrews",4,1104.0531561461794,170,0,1]
["NC June","Tues 1","Fleet","Nathan Armstrong",3,483.02325581395348,1010,1,0]
["NC June","Tues 1","Fleet","Cameron Moury",5,1042.0598006644518,1120,1,1]
["NC June","Tues 1","Fleet","Matthew Moury",4,904.05315614617939,1320,1,1]
["NC June","Tues 1","Fleet","Carl Bitondo",3,766.04651162790697,390,0,1]
["NC June","Tues 1","Fleet","Eric Bitondo",3,766.04651162790697,1850,1,1]
["NC June","Tues Campaign","Fleet","Green",8,27200,0,0,0]
["NC June","Tues Campaign","Fleet","Orange",8,33100,0,0,0]
["NC June","Wed 1","Individual","Robert Arena",5,900,1540,0,1,0]
["NC June","Wed 1","Individual","Steve Andrews",6,1540,900,0,1,640]
["NC June","Wed 2","Mini-Fleet","Bryan Box",3,660.56338028169012,2090,1,0,0]
["NC June","Wed 2","Mini-Fleet","Cameron Hunt",3,660.56338028169012,1730,1,0,0]
["NC June","Wed 2","Mini-Fleet","Eric Bitondo",3,721.12676056338023,1170,0,1,0]
["NC June","Wed 2","Mini-Fleet","Carl Bitondo",3,-139.43661971830988,2090,1,0,0]
["NC June","Wed 2","Mini-Fleet","McCoy Helland",2,932.39436619718299,2040,2,1,0]
["NC June","Wed 2","Mini-Fleet","Tyler Helland",2,1132.394366197183,320,0,1,0]
["NC June","Wed 2","Mini-Fleet","Matthew Larsen",2,1132.394366197183,930,0,1,0]
["NC June","Wed 2","Mini-Fleet","Kevin Plumer",3,1468.7356321839079,1170,1,1,815.86206896551721]
["NC June","Wed 2","Mini-Fleet","Zach Hoernemann",3,1468.7356321839079,1650,1,1,815.86206896551721]
["NC June","Wed 2","Mini-Fleet","Neil Humble",3,834.36781609195396,470,0,0,407.93103448275861]
["NC June","Wed 2","Mini-Fleet","Andy Terpstra",2,1430.344827586207,40,0,1,699.31034482758616]
["NC June","Wed 2","Mini-Fleet","Owen Ronning",3,1468.7356321839079,1840,1,1,815.86206896551721]
["NC June","Wed 2","Mini-Fleet","Mike Smith",2,1430.344827586207,240,0,1,699.31034482758616]
["NC June","Wed 2","Mini-Fleet","Bob Hoernemann",3,1668.7356321839079,1290,0,1,815.86206896551721]
["NC June","Thurs 1","Fleet","Mike Smith",4,1334.4802867383512,610,0,1]
["NC June","Thurs 1","Fleet","Bob Hoernemann",6,1468.1003584229391,1070,0,1]
["NC June","Thurs 1","Fleet","Zach Hoernemann",6,1268.1003584229391,2070,1,1]
["NC June","Thurs 1","Fleet","Tom Palmer",6,1668.1003584229391,3550,0,1]
["NC June","Thurs 1","Fleet","Andy Terpstra",6,1668.1003584229391,1920,0,1]
["NC June","Thurs 1","Fleet","Eric Bitondo",3,1167.6702508960575,1130,0,1]
["NC June","Thurs 1","Fleet","Peter Eillison",4,667.2401433691756,3060,1,0]
["NC June","Thurs 1","Fleet","Peter Eillison",3,583.83512544802875,0,0,0]
["NC June","Thurs 1","Fleet","Ginger Andrews",3,1167.6702508960575,90,0,1]
["NC June","Thurs 1","Fleet","Ron Hunt",4,1334.4802867383512,1130,0,1]
["NC June","Thurs 1","Fleet","Cameron Hunt",6,1668.1003584229391,230,0,1]
["NC June","Thurs 1","Fleet","Robert Arena",5,1501.2903225806451,660,0,1]
["NC June","Thurs 1","Fleet","Carl Bitondo",3,1167.6702508960575,1090,0,1]
["NC June","Thurs 1","Fleet","Owen Ronning",4,1134.4802867383512,560,0,1]
["NC June","Thurs 1","Fleet","Matthew Moury",4,667.2401433691756,1860,1,0]
["NC June","Thurs 1","Fleet","Cameron Moury",5,1501.2903225806451,470,0,1]
["NC June","Thurs 1","Fleet","Nathan Armstrong",3,1167.6702508960575,150,0,1]
["NC June","Thurs 1","Fleet","Matt Andrews",4,1334.4802867383512,330,0,1]
["NC June","Thurs 1","Fleet","Lou Meszaros",5,1175.2941176470588,1370,0,1]
["NC June","Thurs 1","Fleet","Brian Lamb",6,1305.8823529411766,690,0,1]
["NC June","Thurs 1","Fleet","Mark Kuntz",4,844.70588235294122,1450,1,1]
["NC June","Thurs 1","Fleet","Ken Arena",5,587.64705882352939,1120,1,0]
["NC June","Thurs 1","Fleet","Chris Grossaint",6,1305.8823529411766,610,0,1]
["NC June","Thurs 1","Fleet","Chris Pearce",2,391.76470588235293,610,1,0]
["NC June","Thurs 1","Fleet","William Tustin",5,975.29411764705878,3220,1,1]
["NC June","Thurs 1","Fleet","Neil Humble",5,1175.2941176470588,1240,0,1]
["NC June","Thurs 1","Fleet","Kevin Bray",4,1044.7058823529412,890,0,1]
["NC June","Thurs 1","Fleet","Timothy Beckett",6,1305.8823529411766,1680,0,1]
["NC June","Thurs 1","Fleet","Steve Andrews",6,1105.8823529411766,1790,1,1]
["NC June","Thurs 1","Fleet","Richard Whitsell",2,391.76470588235293,20,0,0]
["NC June","Thurs 1","Fleet","Richard Whitsell",3,107.05882352941171,700,1,0]
["NC June","Thurs 1","Fleet","Brian Koehler",5,975.29411764705878,1270,1,1]
["NC June","Thurs 1","Fleet","Kevin Sundberg",6,1105.8823529411766,2600,1,1]
["NC June","Thurs 1","Fleet","Matthew Larsen",4,1044.7058823529412,1390,0,1]
["NC June","Thurs 1","Fleet","McCoy Helland",5,1175.2941176470588,1120,0,1]
["NC June","Thurs 1","Fleet","Tyler Helland",5,1175.2941176470588,1250,0,1]
["NC June","Thurs 1","Fleet","Ken Kelly",1,522.35294117647061,0,0,1]
["NC June","Thurs 1","Fleet","Bryan Box",3,914.11764705882342,250,0,1]
["NC June","Thurs Campaign","Fleet","Green",8,41300,0,0,0]
["NC June","Thurs Campaign","Fleet","Orange",8,24650,0,0,0]

{"sheet":"BattleSummary","index":2,"n_rows":42,"n_cols":46,"rows_kept":42,"cut":false,"hidden":false,"merged":[[6,0,6,6]]}
["Event",null,null,null,null,null,null,null,"Award","Captain","Score","Tie?",null,null,"List of Battles",null,"Points","Class",null,null,null,null,null,null,null,null,"Battles","Class",null,null,null,null,null,null,null,"Average","Class",null,null,null,null,null,null,null,"Individual"]
[null,null,null,null,null,null,null,null,"Individual ","N/A",0,"Yes",null,null,"NY Aug",null,"Captain",1,2,3,4,5,6,7,null,null,"Captain",1,2,3,4,5,6,7,null,"Captain",1,2,3,4,5,6,7,null,"Captain","Points"]
["Fleet Battles",6,null,null,null,null,null,null,"Most Damaged (w/ sink)","William Tustin",3220,null,null,null,"MN Sept",null,"Brian Koehler",null,null,null,null,4499.2193903098896,null,null,null,null,"Brian Koehler",null,null,null,null,4,null,null,null,"Brian Koehler",null,null,null,null,562.4024237887362,null,null,null,"Brian Koehler",0]
[null,null,null,null,null,null,null,null,"Most Damaged (w/o sink)","Tom Palmer",3550,null,null,null,"MI July",null,"Neil Humble",null,null,null,null,3999.2193903098896,null,null,null,null,"Neil Humble",null,null,null,null,4,null,null,null,"Neil Humble",null,null,null,null,499.9024237887362,null,null,null,"Neil Humble",0]
[null,null,null,null,null,null,null,null,null,null,null,null,null,null,"MN Aug",null,"Kevin Bray",null,null,null,4354.8616802754577,null,null,null,null,null,"Kevin Bray",null,null,null,4,null,null,null,null,"Kevin Bray",null,null,null,544.35771003443222,null,null,null,null,"Kevin Bray",0]
[null,null,null,null,null,null,null,null,null,null,null,null,null,null,"NJ Oct",null,"Timothy Beckett",null,null,null,null,null,5243.5771003443224,null,null,null,"Timothy Beckett",null,null,null,null,null,4,null,null,"Timothy Beckett",null,null,null,null,null,655.4471375430403,null,null,"Timothy Beckett",0]
["Fleet Battle Summary",null,null,null,null,null,null,null,"High Sortie Average","Captain","Score","No. of Captains","Tie?",null,"NJ Oct ",null,"Tyler Helland",null,null,null,null,4899.2193903098896,null,null,null,null,"Tyler Helland",null,null,null,null,4,null,null,null,"Tyler Helland",null,null,null,null,612.4024237887362,null,null,null,"Tyler Helland",0]
["Battle","Fleet 1","Fleet 1 Score","Fleet 2","Fleet 2 Score","Winning Fleet","Points Difference",null,"Class 1","Ken Kelly",272.17885501721611,1,"No",null,"NJ Oct",null,"McCoy Helland",null,null,null,null,4899.2193903098896,null,null,null,null,"McCoy Helland",null,null,null,null,4,null,null,null,"McCoy Helland",null,null,null,null,612.4024237887362,null,null,null,"McCoy Helland",0]
["Mon 1","Green",19900,"Orange",19540.001953125,"Green",359.998046875,null,"Class 2","Matthew Larsen",408.88178913738017,3,"No",null,"GA Feb",null,"Ken Kelly",2177.4308401377289,null,null,null,null,null,null,null,null,"Ken Kelly",4,null,null,null,null,null,null,null,"Ken Kelly",272.17885501721611,null,null,null,null,null,null,null,"Ken Kelly",0]
["Mon 2","Green",20890,"Orange",17989.998046875,"Green",2900.001953125,null,"Class 3","Ginger Andrews",496.51020252118502,8,"No",null,"MN May",null,"Lou Meszaros",null,null,null,null,2750.5794376845452,null,null,null,null,"Lou Meszaros",null,null,null,null,4,null,null,null,"Lou Meszaros",null,null,null,null,343.82242971056814,null,null,null,"Lou Meszaros",0]
["Tues 1","Green",20129.998046875,"Orange",20170,"Orange",40.001953125,null,"Class 4","Ron Hunt",667.2401433691756,11,"No",null,"NJ May",null,"Richard Whitsell",null,2874.3815543242408,107.05882352941171,null,null,null,null,null,null,"Richard Whitsell",null,4,1,null,null,null,null,null,"Richard Whitsell",null,359.2976942905301,53.529411764705856,null,null,null,null,null,"Richard Whitsell",0]
["Tues Campaign","Green",27200,"Orange",33100,"Orange",5900,null,"Class 5","Robert Arena",634.03517037134202,11,"No",null,"NC June",null,"Kevin Sundberg",null,null,null,null,null,5243.5771003443224,null,null,null,"Kevin Sundberg",null,null,null,null,null,4,null,null,"Kevin Sundberg",null,null,null,null,null,655.4471375430403,null,null,"Kevin Sundberg",0]
["Thurs 1","Green",19630.001953125,"Orange",22670.001953125,"Orange",3040,null,"Class 6","Andy Terpstra",704.48352263482445,10,"Yes",null,null,null,"William Tustin",null,null,null,null,3450.5794376845442,null,null,null,null,"William Tustin",null,null,null,null,4,null,null,null,"William Tustin",null,null,null,null,431.32242971056803,null,null,null,"William Tustin",0]
["Thurs Campaign","Green",41300,"Orange",24650,"Green",16650,null,"Class 7","Kevin Plumer",627.96130377594272,1,"No",null,null,null,"Brian Lamb",null,null,null,null,null,5443.5771003443224,null,null,null,"Brian Lamb",null,null,null,null,null,4,null,null,"Brian Lamb",null,null,null,null,null,680.4471375430403,null,null,"Brian Lamb",0]
[null,null,null,null,null,null,null,null,null,null,null,null,null,null,null,null,"Chris Pearce",null,391.76470588235293,null,3310.1557979225167,null,null,null,null,null,"Chris Pearce",null,1,null,3,null,null,null,null,"Chris Pearce",null,195.88235294117646,null,551.69263298708609,null,null,null,null,"Chris Pearce",0]
[null,null,null,null,null,null,null,null,null,null,null,null,null,null,null,null,"Bryan Box",null,null,3133.4752162474156,null,null,null,null,null,null,"Bryan Box",null,null,4,null,null,null,null,null,"Bryan Box",null,null,391.68440203092695,null,null,null,null,null,"Bryan Box",0]
[null,null,null,null,null,null,null,null,null,null,null,null,null,null,null,null,"Matthew Larsen",null,817.76357827476033,null,3264.5102425757777,null,null,null,null,null,"Matthew Larsen",null,1,null,3,null,null,null,null,"Matthew Larsen",null,408.88178913738017,null,544.08504042929633,null,null,null,null,"Matthew Larsen",0]
[null,null,null,null,null,null,null,null,null,null,null,null,null,null,null,null,"Mark Kuntz",null,null,null,3091.1032910137128,null,null,null,null,null,"Mark Kuntz",null,null,null,4,null,null,null,null,"Mark Kuntz",null,null,null,386.3879113767141,null,null,null,null,"Mark Kuntz",0]
[null,null,null,null,null,null,null,null,null,null,null,null,null,null,null,null,"Steve Andrews",null,null,null,null,null,5243.5771003443224,null,null,null,"Steve Andrews",null,null,null,null,null,4,null,null,"Steve Andrews",null,null,null,null,null,655.4471375430403,null,null,"Steve Andrews",0]
[null,null,null,null,null,null,null,null,null,null,null,null,null,null,null,null,"Chris Grossaint",null,null,null,null,null,5243.5771003443224,null,null,null,"Chris Grossaint",null,null,null,null,null,4,null,null,"Chris Grossaint",null,null,null,null,null,655.4471375430403,null,null,"Chris Grossaint",0]
[null,null,null,null,null,null,null,null,null,null,null,null,null,null,null,null,"Ken Arena",null,null,null,null,4111.5723314863608,null,null,null,null,"Ken Arena",null,null,null,null,4,null,null,null,"Ken Arena",null,null,null,null,513.9465414357951,null,null,null,"Ken Arena",0]
[null,null,null,null,null,null,null,null,null,null,null,null,null,null,null,null,"Robert Arena",null,null,null,null,5072.2813629707362,null,null,null,null,"Robert Arena",null,null,null,null,4,null,null,null,"Robert Arena",null,null,null,null,634.03517037134202,null,null,null,"Robert Arena",0]
[null,null,null,null,null,null,null,null,null,null,null,null,null,null,null,null,"Andy Terpstra",null,null,null,null,null,5635.8681810785956,null,null,null,"Andy Terpstra",null,null,null,null,null,4,null,null,"Andy Terpstra",null,null,null,null,null,704.48352263482445,null,null,"Andy Terpstra",0]
[null,null,null,null,null,null,null,null,null,null,null,null,null,null,null,null,"Bob Hoernemann",null,null,null,null,null,5435.8681810785956,null,null,null,"Bob Hoernemann",null,null,null,null,null,4,null,null,"Bob Hoernemann",null,null,null,null,null,679.48352263482445,null,null,"Bob Hoernemann",0]
[null,null,null,null,null,null,null,null,null,null,null,null,null,null,null,null,"Zach Hoernemann",null,null,null,null,null,5235.8681810785956,null,null,null,"Zach Hoernemann",null,null,null,null,null,4,null,null,"Zach Hoernemann",null,null,null,null,null,654.48352263482445,null,null,"Zach Hoernemann",0]
[null,null,null,null,null,null,null,null,null,null,null,null,null,null,null,null,"Peter Eillison",null,null,1489.5306075635551,2606.373850504528,null,null,null,null,null,"Peter Eillison",null,null,3,4,null,null,null,null,"Peter Eillison",null,null,248.25510126059251,325.796731313066,null,null,null,null,"Peter Eillison",0]
[null,null,null,null,null,null,null,null,null,null,null,null,null,null,null,null,"Tom Palmer",null,null,null,null,null,5335.8681810785956,null,null,null,"Tom Palmer",null,null,null,null,null,4,null,null,"Tom Palmer",null,null,null,null,null,666.98352263482445,null,null,"Tom Palmer",0]
[null,null,null,null,null,null,null,null,null,null,null,null,null,null,null,null,"Ginger Andrews",null,null,2979.0612151271102,null,null,null,null,null,null,"Ginger Andrews",null,null,3,null,null,null,null,null,"Ginger Andrews",null,null,496.51020252118502,null,null,null,null,null,"Ginger Andrews",0]
[null,null,null,null,null,null,null,null,null,null,null,null,null,null,null,null,"Kevin Plumer",null,null,null,null,null,null,3767.7678226556563,null,null,"Kevin Plumer",null,null,null,null,null,null,3,null,"Kevin Plumer",null,null,null,null,null,null,627.96130377594272,null,"Kevin Plumer",0]
[null,null,null,null,null,null,null,null,null,null,null,null,null,null,null,null,"Nathan Armstrong",null,null,2098.9307948456044,null,1752.6261549798764,null,null,null,null,"Nathan Armstrong",null,null,3,null,2,null,null,null,"Nathan Armstrong",null,null,349.82179914093405,null,438.15653874496911,null,null,null,"Nathan Armstrong",0]
[null,null,null,null,null,null,null,null,null,null,null,null,null,null,null,null,"Owen Ronning",null,null,null,4308.6945448628767,null,null,null,null,null,"Owen Ronning",null,null,null,4,null,null,null,null,"Owen Ronning",null,null,null,538.58681810785959,null,null,null,null,"Owen Ronning",0]
[null,null,null,null,null,null,null,null,null,null,null,null,null,null,null,null,"Matt Andrews",null,null,null,3463.0758157658865,1176.3210702341137,null,null,null,null,"Matt Andrews",null,null,null,3,1,null,null,null,"Matt Andrews",null,null,null,577.17930262764776,588.16053511705684,null,null,null,"Matt Andrews",0]
[null,null,null,null,null,null,null,null,null,null,null,null,null,null,null,null,"Cameron Moury",null,null,null,null,4672.2813629707362,null,null,null,null,"Cameron Moury",null,null,null,null,4,null,null,null,"Cameron Moury",null,null,null,null,584.03517037134202,null,null,null,"Cameron Moury",0]
[null,null,null,null,null,null,null,null,null,null,null,null,null,null,null,null,"Ron Hunt",null,null,1677.4374758589597,1334.4802867383512,null,null,null,null,null,"Ron Hunt",null,null,3,1,null,null,null,null,"Ron Hunt",null,null,279.57291264315995,667.2401433691756,null,null,null,null,"Ron Hunt",0]
[null,null,null,null,null,null,null,null,null,null,null,null,null,null,null,null,"Cameron Hunt",null,null,null,null,null,5635.8681810785956,null,null,null,"Cameron Hunt",null,null,null,null,null,4,null,null,"Cameron Hunt",null,null,null,null,null,704.48352263482445,null,null,"Cameron Hunt",0]
[null,null,null,null,null,null,null,null,null,null,null,null,null,null,null,null,"Matthew Moury",null,null,null,3641.454401493701,null,null,null,null,null,"Matthew Moury",null,null,null,4,null,null,null,null,"Matthew Moury",null,null,null,455.18180018671262,null,null,null,null,"Matthew Moury",0]
[null,null,null,null,null,null,null,null,null,null,null,null,null,null,null,null,"Mati Velzquez",null,null,null,2974.2142581245253,null,null,null,null,null,"Mati Velzquez",null,null,null,3,null,null,null,null,"Mati Velzquez",null,null,null,495.70237635408756,null,null,null,null,"Mati Velzquez",0]
[null,null,null,null,null,null,null,null,null,null,null,null,null,null,null,null,"Mike Smith",null,null,null,4208.6945448628767,null,null,null,null,null,"Mike Smith",null,null,null,4,null,null,null,null,"Mike Smith",null,null,null,526.08681810785959,null,null,null,null,"Mike Smith",0]
[null,null,null,null,null,null,null,null,null,null,null,null,null,null,null,null,"Carl Bitondo",null,null,1933.7167625239645,null,null,null,null,null,null,"Carl Bitondo",null,null,2,null,null,null,null,null,"Carl Bitondo",null,null,483.42919063099112,null,null,null,null,null,"Carl Bitondo",0]
[null,null,null,null,null,null,null,null,null,null,null,null,null,null,null,null,"Eric Bitondo",null,null,1933.7167625239645,null,null,null,null,null,null,"Eric Bitondo",null,null,2,null,null,null,null,null,"Eric Bitondo",null,null,483.42919063099112,null,null,null,null,null,"Eric Bitondo",0]
[null,null,null,null,null,null,null,null,null,null,null,null,null,null,null,null,"Green",null,null,null,null,null,null,null,68500,null,"Green",null,null,null,null,null,null,null,2,"Green",null,null,null,null,null,null,null,null,"Green",0]
[null,null,null,null,null,null,null,null,null,null,null,null,null,null,null,null,"Orange",null,null,null,null,null,null,null,57750,null,"Orange",null,null,null,null,null,null,null,2,"Orange",null,null,null,null,null,null,null,null,"Orange",0]

{"sheet":"Nats Awards","index":3,"n_rows":29,"n_cols":2,"rows_kept":29,"cut":false,"hidden":false,"merged":[]}
["Awards"]
["Fleet Award","Green 149,050: Orange 138,120"]
["Class 1","Ken Kelly - 272"]
["Class 2","Richard Whitsell - 359 Pts."]
["Class 3","Ginger Andrews - 497 Pts. "]
["Class 4","Matthew Andrews - 597 Pts. "]
["Class 5","Robert Arena - 634 Pts. "]
["Class 6","Andy Terpstra and Cameron Hunt - 704 Pts. "]
["Class 7","Kevin Plumer - 628 pts."]
["Von Fluegel","Kevin Plumer 38,827"]
["Best of Scale Warship","Ken Kelly "]
["Best of Scale Convoy","Ken Kelly"]
["Bessed Dressed",""]
["Brian Spychalski Award","Matt Moury"]
["Fire Stick Award","Mati"]
["Individual Combat Trophy","Zach Hoernemann 816"]
["Life Line Award","Robert Arena - 18 runs "]
["Most Damaged Sunk","William Tustin - 3220"]
["Most Damaged NOT Sunk","Tom Palmer - 3550"]
["Ring of Death"]
["Allied Most Feared","Kevin Plumer"]
["Axis Most Feared","Tim Beckett"]
["Rookie of the Year","Owen Ronning"]
["Axis Spirit","Bryan Box"]
["Allied Spirit","Robert Arena"]
["Technology Award","Brian Koehler"]
["Most Spectacular Sink","Will Tustin"]
["Best Ram","Zach Hoernemann"]
["Super Swimmer","Lou Meszaros"]

{"sheet":"Potential Cap List","index":4,"n_rows":151,"n_cols":4,"rows_kept":151,"cut":false,"hidden":false,"merged":[]}
["Captains 2021","Region","Present?","Current Member?"]
["Ginger Andrews","NE",1,"y"]
["Matt Andrews","NE",1,"y"]
["Steve Andrews","NE",1,"y"]
["Ken Arena","NE",1,"y"]
["Robert Arena","NE",1,"y"]
["Evan Fowler","MI",1,"y"]
["Samantha Fowler","MI",null,"y"]
["Kas Gaigalas","MI",1,"y"]
["Nathan Graham","NE",1,"y"]
["Kevin Plumer","NE",1,"y"]
["Craig Singer","MI",1,"y"]
["Caleb Smith","NE",1,"y"]
["Thomas Tanner","NE",1,"y"]
["William Tustin","NE",1,"y"]
["David Vogtman","NE",1,"y"]
["Holly Andews",null,1]
["Julie Hayden",null,1]
["Peter Ellison","MN",null,"y"]
["Adderley Helland","MN",null,"y"]
["Fred Davis III","MN",null,"y"]
["McCoy Helland","MN",null,"y"]
["Tyler Helland","MN",null,"y"]
["Bob Hoernemann","MN",null,"y"]
["Zach Hoernemann","MN",null,"y"]
["Matthew Larson","MN",null,"y"]
["Lou Meszaros","SE",null,"y"]
["Brandon Smith","MN",null,"y"]
["Mike Smith","MN",null,"y"]
["Andy Terpstra","MN",null,"y"]
["Tom Palmer","KC",null,"y"]
["Richard Whitsell","KC",null,"y"]
["Johnny Adams","TX",null,"y"]
["Nathan Armstrong",null,null,"y"]
["Plato Avramides Son",null,null,"y"]
["Plato Avramides",null,null,"y"]
["Lewis Beckett","TX",null,"y"]
["Timothy Beckett","TX",null,"y"]
["Carl Bitondo","SE",null,"y"]
["Eric Bitondo","SE",null,"y"]
["Bryan Box","MN",null,"y"]
["Ted Buehring","TX",null,"y"]
["Michael Butts",null,null,"y"]
["William Byrnes",null,null,"y"]
["Neil Cameron",null,null,"y"]
["Sara Carter","SE",null,"y"]
["Travis Chezick",null,null,"y"]
["Donald Cole",null,null,"y"]
["James Coler",null,null,"y"]
["Steve Crane","NC",null,"y"]
["Heiko Dewald",null,null,"y"]
["Bryan Finster",null,null,"y"]
["D.W. Fluegel",null,null,"y"]
["James Foster",null,null,"y"]
["Joel Goodman","SE",null,"y"]
["John Alvenus","MI",null,"y"]
["Chris Grossaint","SE",null,"y"]
["Alexander Hampton","SE",null,"y"]
["Bob Amend","NE",null,"y"]
["Paul Harrington",null,null,"y"]
["David Haynes","TX",null,"y"]
["Etta Helland","MN",null,"y"]
["Neil Humble","NC",null,"y"]
["Cameron Hunt","NC",null,"y"]
["Ron Hunt","NC",null,"y"]
["Bill Jackson",null,null,"y"]
["Clint Jackson","MN",null,"y"]
["John Jones","SE",null,"y"]
["Carl Camurati","NE",null,"y"]
["Chris Kessler","NC",null,"y"]
["Richard King",null,null,"y"]
["Brian Koehler","SE",null,"y"]
["Hazel Koehler","SE",null,"y"]
["Wade Koehn",null,null,"y"]
["John Kriner",null,null,"y"]
["Mark Kuntz",null,null,"y"]
["Brian Lamb","TX",null,"y"]
["Andrew Le",null,null,"y"]
["Jeff Lide","TX",null,"y"]
["Mark Lide","TX",null,"y"]
["Jeff Lipp","NC",null,"y"]
["Hudson Maiers","MN",null,"y"]
["Michael Mangus","SE",null,"y"]
["Greg McFadden",null,null,"y"]
["Will Cover","MI",null,"y"]
["Weston Dodge","MI",null,"y"]
["Christopher Gaigalas","MI",null,"y"]
["Matthew Mullis","TX",null,"y"]
["Nicholas Myers",null,null,"y"]
["Robert Neumann",null,null,"y"]
["Philip Pace","SE",null,"y"]
["Jason Pagegala",null,null,"y"]
["Michael Pagegala",null,null,"y"]
["Chris Pearce","TX",null,"y"]
["Samuel Pearson","NC",null,"y"]
["Brandon Graham","NE",null,"y"]
["Jeffrey Poindexter",null,null,"y"]
["Gary Powell",null,null,"y"]
["Chase Hargraves","NE",null,"y"]
["David Ranier",null,null,"y"]
["George Reborn",null,null,"y"]
["Gerald Roberts","TX",null,"y"]
["Mark Roe",null,null,"y"]
["Paul Rye",null,null,"y"]
["Jason Schafer",null,null,"y"]
["Brennen Schultz","SE",null,"y"]
["Rick Schultz","SE",null,"y"]
["Trey Schultz","SE",null,"y"]
["Kyle Scott",null,null,"y"]
["David Simmons",null,null,"y"]
["Ken Kelly","NE",null,"y"]
["Isaac McKinzie","NE",null,"y"]
["Karl Smith",null,null,"y"]
["Justin Stalnaker",null,null,"y"]
["Robert Stalnaker","NC",null,"y"]
["Austin Stephens","SE",null,"y"]
["Charley Stephens","SE",null,"y"]
["Sydnee McKinzie","NE",null,"y"]
["Terry McKinzie","NE",null,"y"]
["Michael Tanzillo",null,null,"y"]
["Michael Thomas",null,null,"y"]
["Nathan Thompson",null,null,"y"]
["Barry Tighe",null,null,"y"]
["Mary Tighe",null,null,"y"]
["Hadrian Tucker",null,null,"y"]
["Justin Ragucci","NE",null,"y"]
["Emilio Ragucci","NE",null,"y"]
["Kevin Sundberg","NE",null,"y"]
["Amanda Seltzer","NE",null,"y"]
["Clark Ward","SE",null,"y"]
["Stan Watkins",null,null,"y"]
["Matthew Webb",null,null,"y"]
["Jessica Wheaton",null,null,"y"]
["Gregory Wilson",null,null,"y"]
["Jett Zaruba","TX",null,"y"]
["John Zaruba","TX",null,"y"]
["Mackenzyee Zaruba","TX",null,"y"]
["William Harvard","SE",null,"y"]
["Sam Durham","SE",null,"y"]
["Matthew Moury","NE",null,"y"]
["Sam Kostine",null,null,"y"]
["Andrey Kostine",null,null,"y"]
["Preston Earley","MI",null,"y"]
["Leon Hagadorn","MI"]
["Owen Ronning","MN"]
["Fred Davis III","TX",null,"y"]
["Mattie Vezquez"]
["Glenn Brandon","MN",null,"Y"]
["David Winette","GA"]
["Jacen Winette","GA"]
["Kevin Bray","MN",null,"y"]

{"sheet":"Captains","index":5,"n_rows":39,"n_cols":8,"rows_kept":39,"cut":false,"hidden":false,"merged":[]}
["Captian","Ship","Class","Units",null,null,null,"Enter \"Convoy\" for campaign battles"]
["Ginger Andrews","Des Moises",3,3.5]
["Steve Andrews","North Carolina",6,6,"."]
["Matt Andrews","Baden",5,5.5]
["Robert Arena","Erin",4,4.5]
["Ken Arena","Arizona",5,5.5]
["Brian Koehler","Iron Duke",5,5.5]
["Neil Humble","Queen Elizabeth",5,5.5]
["Kevin Bray","Moltke",4,4]
["Timothy Beckett","Bismarck",6,6.5]
["Tyler Helland","Stralsund",1,1.5]
["McCoy Helland","Fiji ",2,2.5]
["Ken Kelly","South Dakota",6,6.5]
["Lou Meszaros","Mackesen",5,5]
["Richard Whitsell","Tiger",4,4.5]
["Kevin Sundberg","Blucher",3,3.5]
["William Tustin","Seydlitz",4,4.5]
["Brian Lamb","Kaiser",4,4]
["Chris Pearce","Nagato",6,6]
["Bryan Box","Iron Duke",5,5.5]
["Matthew Larsen","Shannon",3,3.5]
["Mark Kuntz","Vanguard",7,7]
["Chris Grossaint","KGV",6,6]
["Andy Terpstra","Virginia",3,3.5]
["Bob Hoernemann","Nassau",4,4]
["Zach Hoernemann","Viribuis Unitias",4,4]
["Peter Eillison","Fargo",3,3]
["Tom Palmer","Deutschland",3,3.5]
["Kevin Plumer","Glorie",2,2.5]
["Nathan Armstrong","Radetzky",3,3.5]
["Owen Ronning","Hipper",3,3.5]
["Cameron Moury","Filbertino",2,2.5]
["Cameron Hunt","Cleveland",3,3]
["Ron Hunt","Von Der Tann",4,4]
["Matthew Moury","Graff Spee",3,3]
["Mati Velzquez","Convoy","Convoy"]
["Mike Smith"]
["Eric Bitondo"]
["Carl Bitondo"]

{"sheet":"Master","index":6,"n_rows":4,"n_cols":20,"rows_kept":4,"cut":false,"hidden":false,"merged":[]}
[null,null,null,null,null,null,null,null,"Winner:",{"$f":"IF(K2>K3, B2, IF(K3>K2, B3, \"Tie\"))","v":"Tie"},null,"Battle Type","Battle Location and Month (i.e. MD May)",null,null,null,null,null,"Fleet"]
["Fleet 1 :","Allied",null,"Fleet Units:",0,"Fleet Weight:",0,"Fleet Battle Damage:",0,"Fleet Score:",0,null,"Battle Day",null,null,null,null,null,"Mini-Fleet"]
["Fleet 2 :","Axis",null,"Fleet Units:",0,"Fleet Weight:",0,"Fleet Battle Damage:",0,"Fleet Score:",0,null,"Battle Number",null,null,null,null,null,"Individual"]
["Captian","Ship","Fleet","Class","Units","Above","On","Below","Sinks","Participate all Sorties","Penalties Points","2nd Sortie Sink","Damage Points","Scored By","Notes","Weight Factor","Weight Points","Captian","Captain Points","Indiv Points"]

{"sheet":"Campaign Master","index":7,"n_rows":17,"n_cols":43,"rows_kept":17,"cut":false,"hidden":false,"merged":[]}
[null,null,null,null,null,null,null,null,"Winner:",{"$f":"IF(K2>K3, B2, IF(K3>K2, B3, \"Tie\"))","v":"Tie"},null,null,"Battle Location and Month (i.e. MD May)","Nats",null,"Convoy Runs",null,null,null,null,null,null,"Sinks",null,null,null,null,null,"Convoy Friendly Ram",null,null,null,null,null,null,"Ram Penalties"]
["Fleet 1 :","Allied",null,null,null,"Fleet Points:",{"$f":"B15","v":0},"Fleet Penalties:",{"$f":"B16","v":0},"Fleet Score:",{"$f":"B17","v":0},null,"Battle Day","Tues",null,"Captain","Fleet","Ship","Ship Length","Number of Runs","Points",null,"Captain","Fleet","Ship","Class","Sink Points",null,"Ramming Captain","Fleet","Convoy Ship","Convoy Captain","Ship Length","Points",null,"Ramming Captain","Fleet","Ram Type","Rammed Captain","Rammed Ship","Rammed Ship Class","Ram Sink","Points"]
["Fleet 2 :","Axis",null,null,null,"Fleet Points:",{"$f":"C15","v":0},"Fleet Penalties:",{"$f":"C16","v":0},"Fleet Score:",{"$f":"C17","v":0}]
[]
["Fleet:",{"$f":"B2","v":"Allied"},{"$f":"B3","v":"Axis"}]
["Targets Remaining:"]
["Target Points:"]
["Convoy Run Points:"]
["Scuttled Convoy Points:"]
["Sink Points:"]
["Convoy Friendly Ram Points:"]
["Ram Penalty Points:"]
["No Ship on Water Points:"]
["Convoy Run Every 10 Min Points:"]
["Total Points:",{"$f":"B7+B8+B9+B10+B11+B13+B14","v":0},{"$f":"C7+C8+C9+C10+C11+C13+C14","v":0}]
["Total Penalties:",{"$f":"B12","v":0},{"$f":"C12","v":0}]
["Fleet Score:",{"$f":"B15-B16","v":0},{"$f":"C15-C16","v":0}]

{"sheet":"MI July Sat 1","index":8,"n_rows":8,"n_cols":20,"rows_kept":8,"cut":false,"hidden":false,"merged":[]}
[null,null,null,null,null,null,null,null,"Winner:",{"$f":"IF(K2>K3, B2, IF(K3>K2, B3, \"Tie\"))","v":"No Flag"},null,"Battle Type","Battle Location and Month (i.e. MD May)","MI July",null,null,null,null,"Fleet"]
["Fleet 1 :","Flag",null,"Fleet Units:",7.5,"Fleet Weight:",15,"Fleet Battle Damage:",2700,"Fleet Score:",1790,null,"Battle Day","Sat",null,null,null,null,"Mini-Fleet"]
["Fleet 2 :","No Flag",null,"Fleet Units:",9,"Fleet Weight:",16,"Fleet Battle Damage:",1790,"Fleet Score:",2700,null,"Battle Number",1,null,null,null,null,"Individual"]
["Captian","Ship","Fleet","Class","Units","Above","On","Below","Sinks","Participate all Sorties","Penalties Points","2nd Sortie Sink","Damage Points","Scored By","Notes","Weight Factor","Weight Points","Captian","Captain Points","Indiv Points"]
["Samantha Fowler","Edward VII","No Flag",3,3.5,23,5,20,0,1,0,0,930,"Evan Fowler","None,None,None",7,1181.25,"Samantha Fowler",1181.25]
["Evan Fowler","Konig","Flag",5,5,37,8,12,2,1,0,1,2690,"Samantha Fowler","None,None,None",9,1074,"Evan Fowler",874]
["Mark Roe","Baden","No Flag",5,5.5,48,1,12,0,1,0,0,860,"Kas","None,None,None",9,1518.75,"Mark Roe",1518.75]
["Kas Gaigalas","Glorie","Flag",2,2.5,1,0,0,0,1,0,0,10,"Mark Roe","None,None,None",6,716,"Kas Gaigalas",716]

{"sheet":"MI July Sat 2","index":9,"n_rows":8,"n_cols":20,"rows_kept":8,"cut":false,"hidden":false,"merged":[]}
[null,null,null,null,null,null,null,null,"Winner:",{"$f":"IF(K2>K3, B2, IF(K3>K2, B3, \"Tie\"))","v":"No Flag"},null,"Battle Type","Battle Location and Month (i.e. MD May)","MI July",null,null,null,null,"Fleet"]
["Fleet 1 :","Flag",null,"Fleet Units:",7.5,"Fleet Weight:",15,"Fleet Battle Damage:",590,"Fleet Score:",580,null,"Battle Day","Sat",null,null,null,null,"Mini-Fleet"]
["Fleet 2 :","No Flag",null,"Fleet Units:",7.5,"Fleet Weight:",15,"Fleet Battle Damage:",580,"Fleet Score:",590,null,"Battle Number",2,null,null,null,null,"Individual"]
["Captian","Ship","Fleet","Class","Units","Above","On","Below","Sinks","Participate all Sorties","Penalties Points","2nd Sortie Sink","Damage Points","Scored By","Notes","Weight Factor","Weight Points","Captian","Captain Points","Indiv Points"]
["Samantha Fowler","Edward VII","No Flag",3,3.5,3,2,3,0,1,0,0,160,"Evan Fowler","None,None,None",7,275.33333333333331,"Samantha Fowler",275.33333333333331]
["Mark Roe","Von Der Tann","No Flag",4,4,6,3,10,0,1,0,0,420,"Evan Fowler","None,None,None",8,314.66666666666669,"Mark Roe",314.66666666666669]
["Kas Gaigalas","Glorie","Flag",2,2.5,0,0,0,0,1,0,0,0,"Mark Roe","None,None,None",6,232,"Kas Gaigalas",232]
["Evan Fowler","Konig","Flag",5,5,30,4,7,0,1,0,0,590,"Samantha Fowler","None,None,None",9,348,"Evan Fowler",348]

{"sheet":"MI July Sat 3","index":10,"n_rows":6,"n_cols":20,"rows_kept":6,"cut":false,"hidden":false,"merged":[]}
[null,null,null,null,null,null,null,null,"Winner:",{"$f":"IF(K2>K3, B2, IF(K3>K2, B3, \"Tie\"))","v":"No Flag"},null,"Battle Type","Battle Location and Month (i.e. MD May)","MI July",null,null,null,null,"Fleet"]
["Fleet 1 :","Flag",null,"Fleet Units:",3.5,"Fleet Weight:",7,"Fleet Battle Damage:",1120,"Fleet Score:",480,null,"Battle Day","Sat",null,null,null,null,"Mini-Fleet"]
["Fleet 2 :","No Flag",null,"Fleet Units:",4,"Fleet Weight:",8,"Fleet Battle Damage:",480,"Fleet Score:",1120,null,"Battle Number",3,null,null,null,null,"Individual"]
["Captian","Ship","Fleet","Class","Units","Above","On","Below","Sinks","Participate all Sorties","Penalties Points","2nd Sortie Sink","Damage Points","Scored By","Notes","Weight Factor","Weight Points","Captian","Captain Points","Indiv Points"]
["Mark Roe","Von Der Tann","No Flag",4,4,6,3,12,0,1,0,0,480,"Samantha Fowler","None,None,None",8,1120,"Mark Roe",1120,640]
["Samantha Fowler","Edward VII","Flag",3,3.5,35,13,17,0,1,0,0,1120,"Mark Roe","None,None,None",7,480,"Samantha Fowler",480,0]

{"sheet":"NY Aug Sat 1","index":11,"n_rows":11,"n_cols":20,"rows_kept":11,"cut":false,"hidden":false,"merged":[]}
[null,null,null,null,null,null,null,null,"Winner:",{"$f":"IF(K2>K3, B2, IF(K3>K2, B3, \"Tie\"))","v":"Allied"},null,"Battle Type","Battle Location and Month (i.e. MD May)","NY Aug",null,null,null,null,"Fleet"]
["Fleet 1 :","Allied",null,"Fleet Units:",20,"Fleet Weight:",34,"Fleet Battle Damage:",2290,"Fleet Score:",4520,null,"Battle Day","Sat",null,null,null,null,"Mini-Fleet"]
["Fleet 2 :","Axis",null,"Fleet Units:",14,"Fleet Weight:",20.5,"Fleet Battle Damage:",4520,"Fleet Score:",1390,null,"Battle Number",1,null,null,null,null,"Individual"]
["Captian","Ship","Fleet","Class","Units","Above","On","Below","Sinks","Participate all Sorties","Penalties Points","2nd Sortie Sink","Damage Points","Scored By","Notes","Weight Factor","Weight Points","Captian","Captain Points","Indiv Points"]
["Matt Andrews","Baden ","Axis",5,5.5,35,2,5,0,0,900,0,540,"Ginger Andrews","Withdraw,None,None",4.5,-397.3170731707317,"Matt Andrews",-397.3170731707317]
["Robert Arena","Arizona","Allied",5,5.5,35,0,8,1,1,0,1,1490,"Matthew Andrews","None,None,None",9,1196.4705882352941,"Robert Arena",996.47058823529414]
["Ginger Andrews","Salem","Allied",3,3.5,0,0,0,0,1,0,0,0,"Thomas Tanner","None,None,None",7,930.58823529411757,"Ginger Andrews",930.58823529411757]
["Justin Ragucci","Rivadavia","Allied",5,5.5,11,6,8,0,1,0,0,470,"Thomas Tanner","None,None,None",9,1196.4705882352941,"Justin Ragucci",1196.4705882352941]
["Thomas Tanner","Ostfriesland","Axis",4,4.5,50,11,19,1,1,0,1,2090,"Steven Andrews","None,None,None",8,893.65853658536594,"Thomas Tanner",693.65853658536594]
["Steve Andrews","Benbow","Allied",5,5.5,20,5,1,0,1,0,0,330,"Thomas Tanner","None,None,None",9,1196.4705882352941,"Steve Andrews",1196.4705882352941]
["Carl Camurati","Nassau","Axis",4,4,50,1,19,1,1,0,1,1890,"Robert Arena","None,None,None",8,893.65853658536594,"Carl Camurati",693.65853658536594]

{"sheet":"NY Aug Sat 2","index":12,"n_rows":10,"n_cols":20,"rows_kept":10,"cut":false,"hidden":false,"merged":[]}
[null,null,null,null,null,null,null,null,"Winner:",{"$f":"IF(K2>K3, B2, IF(K3>K2, B3, \"Tie\"))","v":"Allied"},null,"Battle Type","Battle Location and Month (i.e. MD May)","NY Aug",null,null,null,null,"Fleet"]
["Fleet 1 :","Allied",null,"Fleet Units:",20,"Fleet Weight:",34,"Fleet Battle Damage:",2280,"Fleet Score:",5770,null,"Battle Day","Sat",null,null,null,null,"Mini-Fleet"]
["Fleet 2 :","Axis",null,"Fleet Units:",8.5,"Fleet Weight:",16,"Fleet Battle Damage:",5770,"Fleet Score:",2280,null,"Battle Number",2,null,null,null,null,"Individual"]
["Captian","Ship","Fleet","Class","Units","Above","On","Below","Sinks","Participate all Sorties","Penalties Points","2nd Sortie Sink","Damage Points","Scored By","Notes","Weight Factor","Weight Points","Captian","Captain Points","Indiv Points"]
["Justin Ragucci","Rivadavia","Allied",5,5.5,5,6,9,0,1,0,0,440,"Thomas Tanner","None,None,None",9,1527.3529411764705,"Justin Ragucci",1527.3529411764705]
["Thomas Tanner","Ostfriesland","Axis",4,4.5,75,9,40,1,1,0,1,2930,"Justin Ragucci","None,None,None",8,1140,"Thomas Tanner",940]
["Robert Arena","Arizona","Allied",5,5.5,29,4,11,0,1,0,0,700,"Thomas Tanner","None,None,None",9,1527.3529411764705,"Robert Arena",1527.3529411764705]
["Ginger Andrews","Salem","Allied",3,3.5,3,0,0,0,1,0,0,30,"Thomas Tanner","None,None,None",7,1187.9411764705883,"Ginger Andrews",1187.9411764705883]
["Steve Andrews","Benbow","Allied",5,5.5,46,10,15,0,1,0,0,1110,"Thomas Tanner","None,None,None",9,1527.3529411764705,"Steve Andrews",1527.3529411764705]
["Carl Camurati","Nassau","Axis",4,4,32,4,28,2,1,0,1,2840,"Robert Arena","None,None,None",8,1140,"Carl Camurati",940]

{"sheet":"MN Aug Sat 1","index":13,"n_rows":8,"n_cols":20,"rows_kept":8,"cut":false,"hidden":false,"merged":[]}
[null,null,null,null,null,null,null,null,"Winner:",{"$f":"IF(K2>K3, B2, IF(K3>K2, B3, \"Tie\"))","v":"Flag"},null,"Battle Type","Battle Location and Month (i.e. MD May)","MN Aug",null,null,null,null,"Fleet"]
["Fleet 1 :","Flag",null,"Fleet Units:",8,"Fleet Weight:",15,"Fleet Battle Damage:",1160,"Fleet Score:",2780,null,"Battle Day","Sat",null,null,null,null,"Mini-Fleet"]
["Fleet 2 :","No Flag",null,"Fleet Units:",10,"Fleet Weight:",17,"Fleet Battle Damage:",2780,"Fleet Score:",1160,null,"Battle Number",1,null,null,null,null,"Individual"]
["Captian","Ship","Fleet","Class","Units","Above","On","Below","Sinks","Participate all Sorties","Penalties Points","2nd Sortie Sink","Damage Points","Scored By","Notes","Weight Factor","Weight Points","Captian","Captain Points","Indiv Points"]
["Mark Roe","Baden","Flag",5,5.5,27,4,27,0,1,0,0,1160,"Evan Fowler","None,None,None",9,1668,"Mark Roe",1668]
["Kas Gaigalas","Glorie","Flag",2,2.5,0,0,0,0,1,0,0,0,"Craig Singer","None,None,None",6,1112,"Kas Gaigalas",1112]
["Craig Singer","Jean Bart","No Flag",6,6.5,18,5,8,1,1,0,1,1520,"Mark Roe","None,None,None",10,682.35294117647061,"Craig Singer",482.35294117647061]
["Evan Fowler","Edward VII","No Flag",3,3.5,5,3,15,1,1,0,1,1260,"Mark Roe","None,None,None",7,477.64705882352939,"Evan Fowler",277.64705882352939]

{"sheet":"MN Sept Fri 1","index":14,"n_rows":12,"n_cols":20,"rows_kept":12,"cut":false,"hidden":false,"merged":[]}
[null,null,null,null,null,null,null,null,"Winner:",{"$f":"IF(K2>K3, B2, IF(K3>K2, B3, \"Tie\"))","v":"No Flag"},null,"Battle Type","Battle Location and Month (i.e. MD May)","MN Sept",null,null,null,null,"Fleet"]
["Fleet 1 :","Flag",null,"Fleet Units:",18.5,"Fleet Weight:",33,"Fleet Battle Damage:",6270,"Fleet Score:",2930,null,"Battle Day","Fri",null,null,null,null,"Mini-Fleet"]
["Fleet 2 :","No Flag",null,"Fleet Units:",17,"Fleet Weight:",32,"Fleet Battle Damage:",2930,"Fleet Score:",6270,null,"Battle Number",1,null,null,null,null,"Individual"]
["Captian","Ship","Fleet","Class","Units","Above","On","Below","Sinks","Participate all Sorties","Penalties Points","2nd Sortie Sink","Damage Points","Scored By","Notes","Weight Factor","Weight Points","Captian","Captain Points","Indiv Points"]
["Peter Ellison","Erin","Flag",4,4.5,16,12,25,0,1,0,0,1150,"Peter Ellison","None,None,None",8,710.30303030303037,"Peter Ellison",710.30303030303037]
["Bob Hoernemann","Nagato","Flag",6,6,41,12,22,0,1,0,0,1310,"Bob Hoernemann","None,None,None",10,887.87878787878788,"Bob Hoernemann",887.87878787878788]
["Brandon Smith","Caio Duilio","Flag",4,4.5,55,15,44,1,1,0,1,2970,"Brandon Smith","None,None,None",8,710.30303030303037,"Brandon Smith",510.30303030303037]
["Zach Hoernemann","Shannon","Flag",3,3.5,15,6,19,0,1,0,0,840,"Zach Hoernemann","None,None,None",7,621.5151515151515,"Zach Hoernemann",621.5151515151515]
["Richard Whitsell","Jamaica","No Flag",2,2.5,3,0,0,0,1,0,0,30,"Richard Whitsell","None,None,None",6,1175.625,"Richard Whitsell",1175.625]
["Tom Palmer","Alaska","No Flag",4,4.5,37,5,16,0,1,0,0,950,"Tom Palmer","None,None,None",8,1567.5,"Tom Palmer",1567.5]
["Owen Ronning","Moltke","No Flag",4,4,44,9,9,0,1,0,0,890,"Owen Ronning","None,None,None",8,1567.5,"Owen Ronning",1567.5]
["Andy Terpstra","Nagato","No Flag",6,6,27,8,21,0,1,0,0,1060,"Andy Terpstra","None,None,None",10,1959.375,"Andy Terpstra",1959.375]

{"sheet":"MN Sept Sat 1","index":15,"n_rows":15,"n_cols":20,"rows_kept":15,"cut":false,"hidden":false,"merged":[]}
[null,null,null,null,null,null,null,null,"Winner:",{"$f":"IF(K2>K3, B2, IF(K3>K2, B3, \"Tie\"))","v":"Flag"},null,"Battle Type","Battle Location and Month (i.e. MD May)","MN Sept",null,null,null,null,"Fleet"]
["Fleet 1 :","Flag",null,"Fleet Units:",25.5,"Fleet Weight:",48,"Fleet Battle Damage:",5820,"Fleet Score:",8950,null,"Battle Day","Sat",null,null,null,null,"Mini-Fleet"]
["Fleet 2 :","No Flag",null,"Fleet Units:",23.5,"Fleet Weight:",38,"Fleet Battle Damage:",8950,"Fleet Score:",5820,null,"Battle Number",1,null,null,null,null,"Individual"]
["Captian","Ship","Fleet","Class","Units","Above","On","Below","Sinks","Participate all Sorties","Penalties Points","2nd Sortie Sink","Damage Points","Scored By","Notes","Weight Factor","Weight Points","Captian","Captain Points","Indiv Points"]
["McCoy Helland","Viribus Unitis","Flag",4,4,20,7,8,0,1,0,0,580,"McCoy Helland","None,None,None",8,1491.6666666666665,"McCoy Helland",1491.6666666666665]
["Bob Hoernemann","Nagato","Flag",6,6,28,9,14,0,1,0,0,880,"Bob Hoernemann","None,None,None",10,1864.5833333333335,"Bob Hoernemann",1864.5833333333335]
["Tom Palmer","Alaska","Flag",4,4.5,40,17,32,0,1,0,0,1700,"Tom Palmer","None,None,None",8,1491.6666666666665,"Tom Palmer",1491.6666666666665]
["Brandon Smith","Caio Duilio","Flag",4,4.5,16,5,8,0,1,0,0,500,"Brandon Smith","None,None,None",8,1491.6666666666665,"Brandon Smith",1491.6666666666665]
["Owen Ronning","Moltke","Flag",4,4,82,13,36,0,1,0,0,2160,"Owen Ronning","None,None,None",8,1491.6666666666665,"Owen Ronning",1491.6666666666665]
["Richard Whitsell","Jamaica","Flag",2,2.5,0,0,0,0,1,0,0,0,"Richard Whitsell","None,None,None",6,1118.75,"Richard Whitsell",1118.75]
["Andy Terpstra","Nagato","No Flag",6,6,60,9,28,0,1,0,0,1620,"Mike Smith","None,None,None",10,1531.578947368421,"Andy Terpstra",1531.578947368421]
["Tyler Helland","Florida","No Flag",4,4,61,8,26,2,1,0,1,3150,"Tyler Helland","None,None,None",8,1225.2631578947369,"Tyler Helland",1025.2631578947369]
["Matthew Larson","Seydlitz","No Flag",4,4.5,4,1,14,0,0,0,0,480,"Matthew Larson","None,None,None",4,612.63157894736844,"Matthew Larson",612.63157894736844]
["Mike Smith","Seydlitz","No Flag",4,4.5,45,10,37,0,1,0,0,1760,"Andy Terpstra","None,None,None",8,1225.2631578947369,"Mike Smith",1225.2631578947369]
["Peter Ellison","Erin","No Flag",4,4.5,49,17,37,0,1,0,0,1940,"Peter Ellison","None,None,None",8,1225.2631578947369,"Peter Ellison",1225.2631578947369]

{"sheet":"MN Sept Sat 2","index":16,"n_rows":16,"n_cols":20,"rows_kept":16,"cut":false,"hidden":false,"merged":[]}
[null,null,null,null,null,null,null,null,"Winner:",{"$f":"IF(K2>K3, B2, IF(K3>K2, B3, \"Tie\"))","v":"Flag"},null,"Battle Type","Battle Location and Month (i.e. MD May)","MN Sept",null,null,null,null,"Fleet"]
["Fleet 1 :","Flag",null,"Fleet Units:",25.5,"Fleet Weight:",48,"Fleet Battle Damage:",5820,"Fleet Score:",7359.99951171875,null,"Battle Day","Sat",null,null,null,null,"Mini-Fleet"]
["Fleet 2 :","No Flag",null,"Fleet Units:",26.5,"Fleet Weight:",49,"Fleet Battle Damage:",7360,"Fleet Score:",5820,null,"Battle Number",2,null,null,null,null,"Individual"]
["Captian","Ship","Fleet","Class","Units","Above","On","Below","Sinks","Participate all Sorties","Penalties Points","2nd Sortie Sink","Damage Points","Scored By","Notes","Weight Factor","Weight Points","Captian","Captain Points","Indiv Points"]
["Owen Ronning","Moltke","Flag",4,4,51,3,13,0,1,0,0,960,"Owen Ronning","None,None,None",8,1226.6666666666665,"Owen Ronning",1226.6666666666665]
["Tom Palmer","Alaska","Flag",4,4.5,31,5,27,0,1,0,0,1220,"Tom Palmer","None,None,None",8,1226.6666666666665,"Tom Palmer",1226.6666666666665]
["Richard Whitsell","Jamaica","Flag",2,2.5,0,1,1,0,1,0,0,50,"Richard Whitsell","None,None,None",6,920,"Richard Whitsell",920]
["Bob Hoernemann","Nagato","Flag",6,6,31,11,12,0,1,0,0,890,"Bob Hoernemann","None,None,None",10,1533.3333333333335,"Bob Hoernemann",1533.3333333333335]
["McCoy Helland","Viribus Unitis","Flag",4,4,38,10,12,0,1,0,0,940,"McCoy Helland","None,None,None",8,1226.6666666666665,"McCoy Helland",1226.6666666666665]
["Brandon Smith","Caio Duilio","Flag",4,4.5,61,8,33,0,1,0,0,1760,"Brandon Smith","None,None,None",8,1226.6666666666665,"Brandon Smith",1226.6666666666665]
["Tyler Helland","Florida","No Flag",4,4,44,7,14,0,1,0,0,1000,"Tyler Helland","None,None,None",8,950.20408163265301,"Tyler Helland",950.20408163265301]
["Mike Smith","Seydlitz","No Flag",4,4.5,36,15,14,0,1,0,0,1080,"Andy Terpstra","None,None,None",8,950.20408163265301,"Mike Smith",950.20408163265301]
["Andy Terpstra","Nagato","No Flag",6,6,41,15,32,0,1,0,0,1670,"Mike Smith","None,None,None",10,1187.7551020408164,"Andy Terpstra",1187.7551020408164]
["Peter Ellison","Erin","No Flag",4,4.5,61,6,52,1,1,0,1,3090,"Peter Ellison","None,None,None",8,950.20408163265301,"Peter Ellison",750.20408163265301]
["Adderley Helland","Duquesne","No Flag",3,3,0,1,1,0,1,0,0,50,"Adderley Helland","None,None,None",7,831.42857142857133,"Adderley Helland",831.42857142857133]
["Matthew Larson","Seydlitz","No Flag",4,4.5,16,2,9,0,1,0,0,470,"Matthew Larson","None,None,None",8,950.20408163265301,"Matthew Larson",950.20408163265301]

{"sheet":"MN Sept Sat 3","index":17,"n_rows":16,"n_cols":20,"rows_kept":16,"cut":false,"hidden":false,"merged":[]}
[null,null,null,null,null,null,null,null,"Winner:",{"$f":"IF(K2>K3, B2, IF(K3>K2, B3, \"Tie\"))","v":"Flag"},null,"Battle Type","Battle Location and Month (i.e. MD May)","MN Sept",null,null,null,null,"Fleet"]
["Fleet 1 :","Flag",null,"Fleet Units:",25.5,"Fleet Weight:",48,"Fleet Battle Damage:",6680,"Fleet Score:",6710.00048828125,null,"Battle Day","Sat",null,null,null,null,"Mini-Fleet"]
["Fleet 2 :","No Flag",null,"Fleet Units:",26.5,"Fleet Weight:",49,"Fleet Battle Damage:",6710,"Fleet Score:",6680,null,"Battle Number",3,null,null,null,null,"Individual"]
["Captian","Ship","Fleet","Class","Units","Above","On","Below","Sinks","Participate all Sorties","Penalties Points","2nd Sortie Sink","Damage Points","Scored By","Notes","Weight Factor","Weight Points","Captian","Captain Points","Indiv Points"]
["Richard Whitsell","Jamaica","Flag",2,2.5,0,3,1,0,1,0,0,90,"Richard Whitsell","None,None,None",6,838.75,"Richard Whitsell",838.75]
["Bob Hoernemann","Nagato","Flag",6,6,60,11,29,0,1,0,0,1690,"Bob Hoernemann","None,None,None",10,1397.9166666666667,"Bob Hoernemann",1397.9166666666667]
["Brandon Smith","Caio Duilio","Flag",4,4.5,20,6,17,0,1,0,0,830,"Brandon Smith","None,None,None",8,1118.3333333333333,"Brandon Smith",1118.3333333333333]
["Owen Ronning","Moltke","Flag",4,4,50,8,17,1,1,0,1,1970,"Owen Ronning","None,None,None",8,1118.3333333333333,"Owen Ronning",918.33333333333326]
["Tom Palmer","Alaska","Flag",4,4.5,43,8,13,0,1,0,0,980,"Tom Palmer","None,None,None",8,1118.3333333333333,"Tom Palmer",1118.3333333333333]
["McCoy Helland","Viribus Unitis","Flag",4,4,48,14,12,0,1,0,0,1120,"McCoy Helland","None,None,None",8,1118.3333333333333,"McCoy Helland",1118.3333333333333]
["Adderley Helland","Duquesne","No Flag",3,3,9,4,0,0,1,0,0,170,"Adderley Helland","None,None,None",7,954.28571428571422,"Adderley Helland",954.28571428571422]
["Tyler Helland","Florida","No Flag",4,4,61,6,13,1,1,0,1,1920,"Tyler Helland","None,None,None",8,1090.612244897959,"Tyler Helland",890.61224489795904]
["Andy Terpstra","Nagato","No Flag",6,6,65,18,40,0,1,0,0,2210,"Andy Terpstra","None,None,None",10,1363.2653061224489,"Andy Terpstra",1363.2653061224489]
["Peter Ellison","Erin","No Flag",4,4.5,49,11,19,0,1,0,0,1280,"Peter Ellison","None,None,None",8,1090.612244897959,"Peter Ellison",1090.612244897959]
["Matthew Larson","Seydlitz","No Flag",4,4.5,11,5,3,0,1,0,0,300,"Matthew Larson","None,None,None",8,1090.612244897959,"Matthew Larson",1090.612244897959]
["Mike Smith","Seydlitz","No Flag",4,4.5,32,3,15,0,1,0,0,830,"Mike Smith","None,None,None",8,1090.612244897959,"Mike Smith",1090.612244897959]

{"sheet":"MN Sept Sun 1","index":18,"n_rows":16,"n_cols":20,"rows_kept":16,"cut":false,"hidden":false,"merged":[]}
[null,null,null,null,null,null,null,null,"Winner:",{"$f":"IF(K2>K3, B2, IF(K3>K2, B3, \"Tie\"))","v":"Flag"},null,"Battle Type","Battle Location and Month (i.e. MD May)","MN Sept",null,null,null,null,"Fleet"]
["Fleet 1 :","Flag",null,"Fleet Units:",21.5,"Fleet Weight:",40,"Fleet Battle Damage:",5500,"Fleet Score:",10050,null,"Battle Day","Sun",null,null,null,null,"Mini-Fleet"]
["Fleet 2 :","No Flag",null,"Fleet Units:",29,"Fleet Weight:",56,"Fleet Battle Damage:",10050,"Fleet Score:",5500.00048828125,null,"Battle Number",1,null,null,null,null,"Individual"]
["Captian","Ship","Fleet","Class","Units","Above","On","Below","Sinks","Participate all Sorties","Penalties Points","2nd Sortie Sink","Damage Points","Scored By","Notes","Weight Factor","Weight Points","Captian","Captain Points","Indiv Points"]
["Bob Hoernemann","Nagato","Flag",6,6,44,7,17,0,1,0,0,1090,"Bob Hoernemann","None,None,None",10,2512.5,"Bob Hoernemann",2512.5]
["McCoy Helland","Viribus Unitis","Flag",4,4,38,7,17,0,1,0,0,1030,"McCoy Helland","None,None,None",8,2010,"McCoy Helland",2010]
["Glenn Brandon","Caio Duilio","Flag",4,4.5,70,11,21,0,1,0,0,1550,"Glenn Brandon","None,None,None",8,2010,"Glenn Brandon",2010]
["Richard Whitsell","Jamaica","Flag",2,2.5,0,0,1,0,1,0,0,30,"Richard Whitsell","None,None,None",6,1507.5,"Richard Whitsell",1507.5]
["Tom Palmer","Alaska","Flag",4,4.5,66,12,30,0,1,0,0,1800,"Tom Palmer","None,None,None",8,2010,"Tom Palmer",2010]
["Andy Terpstra","Nagato","No Flag",6,6,38,8,9,0,1,0,0,810,"Andy Terpstra","None,None,None",10,982.14285714285711,"Andy Terpstra",982.14285714285711]
["Owen Ronning","Moltke","No Flag",4,4,77,23,29,1,1,0,1,2900,"Owen Ronning","None,None,None",8,785.71428571428567,"Owen Ronning",585.71428571428567]
["Tyler Helland","Florida","No Flag",4,4,40,9,42,2,1,0,1,3440,"Tyler Helland","None,None,None",8,785.71428571428567,"Tyler Helland",585.71428571428567]
["Matthew Larson","Seydlitz","No Flag",4,4.5,14,3,5,0,1,0,0,350,"Matthew Larson","None,None,None",8,785.71428571428567,"Matthew Larson",785.71428571428567]
["Etta Helland","New Orleans","No Flag",3,3,13,2,13,1,1,0,1,1260,"Adderley Helland","None,None,None",7,687.5,"Etta Helland",487.5]
["Adderley Helland","Duquesne","No Flag",3,3,5,5,4,0,1,0,0,270,"Adderley Helland","None,None,None",7,687.5,"Adderley Helland",687.5]
["Peter Ellison","Erin","No Flag",4,4.5,17,5,25,0,1,0,0,1020,"Peter Ellison","None,None,None",8,785.71428571428567,"Peter Ellison",785.71428571428567]

{"sheet":"MN Sept Sun 2","index":19,"n_rows":15,"n_cols":20,"rows_kept":15,"cut":false,"hidden":false,"merged":[]}
[null,null,null,null,null,null,null,null,"Winner:",{"$f":"IF(K2>K3, B2, IF(K3>K2, B3, \"Tie\"))","v":"Flag"},null,"Battle Type","Battle Location and Month (i.e. MD May)","MN Sept",null,null,null,null,"Fleet"]
["Fleet 1 :","Flag",null,"Fleet Units:",22.5,"Fleet Weight:",45,"Fleet Battle Damage:",5900,"Fleet Score:",7579.99951171875,null,"Battle Day","Sun",null,null,null,null,"Mini-Fleet"]
["Fleet 2 :","No Flag",null,"Fleet Units:",22,"Fleet Weight:",41,"Fleet Battle Damage:",8180,"Fleet Score:",5900.00048828125,null,"Battle Number",2,null,null,null,null,"Individual"]
["Captian","Ship","Fleet","Class","Units","Above","On","Below","Sinks","Participate all Sorties","Penalties Points","2nd Sortie Sink","Damage Points","Scored By","Notes","Weight Factor","Weight Points","Captian","Captain Points","Indiv Points"]
["Owen Ronning","Moltke","Flag",4,4,106,12,25,1,1,0,1,2850,"Owen Ronning","None,None,None",8,1454.2222222222222,"Owen Ronning",1254.2222222222222]
["McCoy Helland","Viribus Unitis","Flag",4,4,23,11,19,0,1,0,0,1020,"McCoy Helland","None,None,None",8,1454.2222222222222,"McCoy Helland",1454.2222222222222]
["Tom Palmer","Alaska","Flag",4,4.5,32,13,33,0,1,0,0,1570,"Tom Palmer","None,None,None",8,1454.2222222222222,"Tom Palmer",1454.2222222222222]
["Adderley Helland","Duquesne","Flag",3,3,0,0,0,0,1,0,0,0,"Adderley Helland","None,None,None",7,1272.4444444444446,"Adderley Helland",1272.4444444444446]
["Richard Whitsell","Jamaica","Flag",2,2.5,0,0,0,0,1,600,0,0,"Richard Whitsell","Withdraw,None,None",6,490.66666666666674,"Richard Whitsell",490.66666666666674]
["Glenn Brandon","Caio Duilio","Flag",4,4.5,23,1,7,0,1,0,0,460,"Glenn Brandon","None,None,None",8,1454.2222222222222,"Glenn Brandon",1454.2222222222222]
["Andy Terpstra","Nagato","No Flag",6,6,59,17,22,0,1,0,0,1590,"Andy Terpstra","None,None,None",10,1439.0243902439024,"Andy Terpstra",1439.0243902439024]
["Peter Ellison","Erin","No Flag",4,4.5,26,11,39,0,1,0,0,1650,"Peter Ellison","None,None,None",8,1151.219512195122,"Peter Ellison",1151.219512195122]
["Etta Helland","New Orleans","No Flag",3,3,31,19,22,2,1,0,1,2750,"Etta Helland","None,None,None",7,1007.3170731707318,"Etta Helland",807.31707317073176]
["Matthew Larson","Seydlitz","No Flag",4,4.5,8,8,12,1,1,0,1,1400,"Matthew Larson","None,None,None",8,1151.219512195122,"Matthew Larson",951.21951219512198]
["Tyler Helland","Florida","No Flag",4,4,40,3,11,0,1,0,0,790,"Tyler Helland","None,None,None",8,1151.219512195122,"Tyler Helland",1151.219512195122]

{"sheet":"NJ Oct Fri 1","index":20,"n_rows":9,"n_cols":20,"rows_kept":9,"cut":false,"hidden":false,"merged":[]}
[null,null,null,null,null,null,null,null,"Winner:",{"$f":"IF(K2>K3, B2, IF(K3>K2, B3, \"Tie\"))","v":"No Flag"},null,"Battle Type","Battle Location and Month (i.e. MD May)","NJ Oct",null,null,null,null,"Fleet"]
["Fleet 1 :","Flag",null,"Fleet Units:",13.5,"Fleet Weight:",24,"Fleet Battle Damage:",5210,"Fleet Score:",3830,null,"Battle Day","Fri",null,null,null,null,"Mini-Fleet"]
["Fleet 2 :","No Flag",null,"Fleet Units:",12,"Fleet Weight:",19,"Fleet Battle Damage:",3830,"Fleet Score:",5210,null,"Battle Number",1,null,null,null,null,"Individual"]
["Captian","Ship","Fleet","Class","Units","Above","On","Below","Sinks","Participate all Sorties","Penalties Points","2nd Sortie Sink","Damage Points","Scored By","Notes","Weight Factor","Weight Points","Captian","Captain Points","Indiv Points"]
["Richard Whitsell","Jamaica","Flag",2,2.5,3,0,0,0,1,0,0,30,"Richard Whitsell","None,None,None",6,957.5,"Richard Whitsell",957.5]
["Kevin Plumer","Kongo ","Flag",4,4.5,67,13,47,1,1,0,1,3140,"Emilio Ragguci","None,None,None",8,1276.6666666666665,"Kevin Plumer",1076.6666666666665]
["Justin Ragucci","Rivadavia","No Flag",5,5.5,75,19,17,0,1,0,0,1640,"Kevin Plumer","None,None,None",9,2467.894736842105,"Justin Ragucci",2467.894736842105]
["William Tustin","Jean Bart","No Flag",6,6.5,55,16,44,0,1,0,0,2190,"Kevin Plumer","None,None,None",10,2742.1052631578946,"William Tustin",2742.1052631578946]
["Kevin Sundberg","South Dakota","Flag",6,6.5,29,3,23,1,1,0,1,2040,"Justin Ragucci","None,None,None",10,1595.8333333333335,"Kevin Sundberg",1395.8333333333335]

{"sheet":"NJ Oct Fri 2","index":21,"n_rows":9,"n_cols":20,"rows_kept":9,"cut":false,"hidden":false,"merged":[]}
[null,null,null,null,null,null,null,null,"Winner:",{"$f":"IF(K2>K3, B2, IF(K3>K2, B3, \"Tie\"))","v":"No Flag"},null,"Battle Type","Battle Location and Month (i.e. MD May)","NJ Oct",null,null,null,null,"Fleet"]
["Fleet 1 :","Flag",null,"Fleet Units:",11,"Fleet Weight:",18,"Fleet Battle Damage:",4720,"Fleet Score:",2620,null,"Battle Day","Fri",null,null,null,null,"Mini-Fleet"]
["Fleet 2 :","No Flag",null,"Fleet Units:",12.5,"Fleet Weight:",19.5,"Fleet Battle Damage:",2620,"Fleet Score:",4720,null,"Battle Number",2,null,null,null,null,"Individual"]
["Captian","Ship","Fleet","Class","Units","Above","On","Below","Sinks","Participate all Sorties","Penalties Points","2nd Sortie Sink","Damage Points","Scored By","Notes","Weight Factor","Weight Points","Captian","Captain Points","Indiv Points"]
["William Tustin","Jean Bart","No Flag",6,6.5,48,12,29,0,1,0,0,1590,"Kevin Sundberg","None,None,None",10,2420.5128205128203,"William Tustin",2420.5128205128203]
["Kevin Sundberg","South Dakota","Flag",6,6.5,57,9,25,1,1,0,1,2500,"Will Tustin","None,None,None",10,1455.5555555555557,"Kevin Sundberg",1255.5555555555557]
["Kevin Plumer","Kongo ","Flag",4,4.5,72,24,34,0,1,0,0,2220,"Justin Ragucci","None,None,None",8,1164.4444444444443,"Kevin Plumer",1164.4444444444443]
["Emilio Ragucci","Blucher","No Flag",3,3.5,5,0,3,1,0,0,0,840,"Kevin Plumer","None,None,None",3.5,847.17948717948718,"Emilio Ragucci",847.17948717948718]
["Richard Whitsell","Jamaica","No Flag",2,2.5,11,1,2,0,1,0,0,190,"Kevin Plumer","None,None,None",6,1452.3076923076924,"Richard Whitsell",1452.3076923076924]

{"sheet":"NJ Oct Sat 1","index":22,"n_rows":12,"n_cols":20,"rows_kept":12,"cut":false,"hidden":false,"merged":[]}
[null,null,null,null,null,null,null,null,"Winner:",{"$f":"IF(K2>K3, B2, IF(K3>K2, B3, \"Tie\"))","v":"No Flag"},null,"Battle Type","Battle Location and Month (i.e. MD May)","NJ Oct",null,null,null,null,"Fleet"]
["Fleet 1 :","Flag",null,"Fleet Units:",25,"Fleet Weight:",38,"Fleet Battle Damage:",7870,"Fleet Score:",3050,null,"Battle Day","Sat",null,null,null,null,"Mini-Fleet"]
["Fleet 2 :","No Flag",null,"Fleet Units:",17.5,"Fleet Weight:",28,"Fleet Battle Damage:",4050,"Fleet Score:",7870.00048828125,null,"Battle Number",1,null,null,null,null,"Individual"]
["Captian","Ship","Fleet","Class","Units","Above","On","Below","Sinks","Participate all Sorties","Penalties Points","2nd Sortie Sink","Damage Points","Scored By","Notes","Weight Factor","Weight Points","Captian","Captain Points","Indiv Points"]
["William Tustin","Jean Bart","No Flag",6,6.5,53,10,15,0,1,0,0,1180,"Robert Arena","None,None,None",10,2810.7142857142858,"William Tustin",2810.7142857142858]
["Matt Andrews","Baden","Flag",5,5.5,43,9,44,1,1,0,1,2830,"Will Tustin","None,None,None",9,959.21052631578937,"Matt Andrews",759.21052631578937]
["Justin Ragucci","Rivadavia","No Flag",5,5.5,27,11,13,0,1,0,0,880,"Ken Arena","None,None,None",9,2529.6428571428573,"Justin Ragucci",2529.6428571428573]
["Kevin Sundberg","South Dakota","Flag",6,6.5,20,0,15,0,0,1000,0,650,"Emilio Ragucci","Withdraw,None,None",5,-467.1052631578948,"Kevin Sundberg",-467.1052631578948]
["Ken Arena","Iron Duke","Flag",5,5,24,13,21,1,1,0,1,2030,"Justin Ragucci","None,None,None",9,959.21052631578937,"Ken Arena",759.21052631578937]
["Robert Arena","Arizona ","Flag",5,5.5,30,8,26,1,1,0,1,2140,"Kevin Plumer","None,None,None",9,959.21052631578937,"Robert Arena",759.21052631578937]
["Richard Whitsell","Jamaica","Flag",2,2.5,8,4,2,0,1,0,0,220,"Kevin Plumer","None,None,None",6,639.47368421052624,"Richard Whitsell",639.47368421052624]
["Kevin Plumer","Malaya","No Flag",5,5.5,117,11,20,0,1,0,0,1990,"Matthew Andrews","None,None,None",9,2529.6428571428573,"Kevin Plumer",2529.6428571428573]

{"sheet":"NJ Oct Sat 2","index":23,"n_rows":13,"n_cols":20,"rows_kept":13,"cut":false,"hidden":false,"merged":[]}
[null,null,null,null,null,null,null,null,"Winner:",{"$f":"IF(K2>K3, B2, IF(K3>K2, B3, \"Tie\"))","v":"No Flag"},null,"Battle Type","Battle Location and Month (i.e. MD May)","NJ Oct",null,null,null,null,"Fleet"]
["Fleet 1 :","Flag",null,"Fleet Units:",22.5,"Fleet Weight:",37,"Fleet Battle Damage:",9720,"Fleet Score:",4300,null,"Battle Day","Sat",null,null,null,null,"Mini-Fleet"]
["Fleet 2 :","No Flag",null,"Fleet Units:",23.5,"Fleet Weight:",37.5,"Fleet Battle Damage:",4300,"Fleet Score:",9720,null,"Battle Number",2,null,null,null,null,"Individual"]
["Captian","Ship","Fleet","Class","Units","Above","On","Below","Sinks","Participate all Sorties","Penalties Points","2nd Sortie Sink","Damage Points","Scored By","Notes","Weight Factor","Weight Points","Captian","Captain Points","Indiv Points"]
["William Tustin","Jean Bart","No Flag",6,6.5,20,7,19,0,1,0,0,910,"Ken Arena","None,None,None",10,2592,"William Tustin",2592]
["Ken Arena","Iron Duke","Flag",5,5,33,9,15,2,1,0,1,2760,"William Tustin","None,None,None",9,1045.9459459459461,"Ken Arena",845.94594594594605]
["Matt Andrews","Baden","No Flag",5,5.5,51,8,14,0,1,0,0,1090,"Kevin Sundberg","None,None,None",9,2332.7999999999997,"Matt Andrews",2332.7999999999997]
["Kevin Plumer","Malaya","Flag",5,5.5,62,13,36,1,1,0,1,2860,"Justin Ragucci","None,None,None",9,1045.9459459459461,"Kevin Plumer",845.94594594594605]
["Robert Arena","Arizona ","Flag",5,5.5,67,8,13,1,1,0,1,2120,"Matthew Andrews","None,None,None",9,1045.9459459459461,"Robert Arena",845.94594594594605]
["Justin Ragucci","Rivadavia","No Flag",5,5.5,48,8,20,0,1,0,0,1240,"Kevin Plumer","None,None,None",9,2332.7999999999997,"Justin Ragucci",2332.7999999999997]
["Emilio Ragucci","Blucher","No Flag",3,3.5,9,1,2,1,0,0,0,870,"Kevin Plumer","None,None,None",3.5,907.2,"Emilio Ragucci",907.2]
["Richard Whitsell","Jamaica","No Flag",2,2.5,4,0,5,0,1,0,0,190,"Kevin Plumer","None,None,None",6,1555.2,"Richard Whitsell",1555.2]
["Kevin Sundberg","South Dakota","Flag",6,6.5,38,6,16,1,1,0,1,1980,"Matthew Andrews","None,None,None",10,1162.1621621621623,"Kevin Sundberg",962.1621621621623]

{"sheet":"NJ Oct  Sat 3","index":24,"n_rows":12,"n_cols":20,"rows_kept":12,"cut":false,"hidden":false,"merged":[]}
[null,null,null,null,null,null,null,null,"Winner:",{"$f":"IF(K2>K3, B2, IF(K3>K2, B3, \"Tie\"))","v":"No Flag"},null,"Battle Type","Battle Location and Month (i.e. MD May)","NJ Oct ",null,null,null,null,"Fleet"]
["Fleet 1 :","Flag",null,"Fleet Units:",22.5,"Fleet Weight:",37,"Fleet Battle Damage:",8690,"Fleet Score:",5030,null,"Battle Day","Sat",null,null,null,null,"Mini-Fleet"]
["Fleet 2 :","No Flag",null,"Fleet Units:",20,"Fleet Weight:",34,"Fleet Battle Damage:",5030,"Fleet Score:",8690,null,"Battle Number",3,null,null,null,null,"Individual"]
["Captian","Ship","Fleet","Class","Units","Above","On","Below","Sinks","Participate all Sorties","Penalties Points","2nd Sortie Sink","Damage Points","Scored By","Notes","Weight Factor","Weight Points","Captian","Captain Points","Indiv Points"]
["William Tustin","Jean Bart","No Flag",6,6.5,73,15,28,0,1,0,0,1870,"Robert Arena","None,None,None",10,2555.8823529411766,"William Tustin",2555.8823529411766]
["Robert Arena","Arizona ","Flag",5,5.5,29,9,39,1,1,0,1,2540,"William Tustin","None,None,None",9,1223.5135135135135,"Robert Arena",1023.5135135135135]
["Ken Arena","Iron Duke","Flag",5,5,18,3,3,1,1,0,1,1230,"Robert Arena","None,None,None",9,1223.5135135135135,"Ken Arena",1023.5135135135135]
["Richard Whitsell","Jamaica","No Flag",2,2.5,3,3,1,0,1,0,0,120,"Ken Arena","None,None,None",6,1533.5294117647061,"Richard Whitsell",1533.5294117647061]
["Justin Ragucci","Rivadavia","No Flag",5,5.5,41,19,18,1,1,0,1,2230,"Kevin Sundberg","None,None,None",9,2300.294117647059,"Justin Ragucci",2100.294117647059]
["Kevin Sundberg","South Dakota","Flag",6,6.5,29,5,26,0,1,0,0,1170,"Justin Ragucci","None,None,None",10,1359.4594594594596,"Kevin Sundberg",1359.4594594594596]
["Matt Andrews","Baden","No Flag",5,5.5,35,5,12,0,1,0,0,810,"Robert Arena","None,None,None",9,2300.294117647059,"Matt Andrews",2300.294117647059]
["Kevin Plumer","Malaya","Flag",5,5.5,91,19,52,1,1,0,1,3750,"Flag","None,None,None",9,1223.5135135135135,"Kevin Plumer",1023.5135135135135]

{"sheet":"NJ Oct Sun 1","index":25,"n_rows":11,"n_cols":20,"rows_kept":11,"cut":false,"hidden":false,"merged":[]}
[null,null,null,null,null,null,null,null,"Winner:",{"$f":"IF(K2>K3, B2, IF(K3>K2, B3, \"Tie\"))","v":"No Flag"},null,"Battle Type","Battle Location and Month (i.e. MD May)","NJ Oct",null,null,null,null,"Fleet"]
["Fleet 1 :","Flag",null,"Fleet Units:",19.5,"Fleet Weight:",29.5,"Fleet Battle Damage:",6730,"Fleet Score:",4530,null,"Battle Day","Sun",null,null,null,null,"Mini-Fleet"]
["Fleet 2 :","No Flag",null,"Fleet Units:",15.5,"Fleet Weight:",22.5,"Fleet Battle Damage:",4530,"Fleet Score:",6730,null,"Battle Number",1,null,null,null,null,"Individual"]
["Captian","Ship","Fleet","Class","Units","Above","On","Below","Sinks","Participate all Sorties","Penalties Points","2nd Sortie Sink","Damage Points","Scored By","Notes","Weight Factor","Weight Points","Captian","Captain Points","Indiv Points"]
["Kevin Sundberg","South Dakota","Flag",6,6.5,46,6,48,1,1,0,1,3020,"William Tustin","None,None,None",10,1535.593220338983,"Kevin Sundberg",1335.593220338983]
["William Tustin","Jean Bart","No Flag",6,6.5,51,0,2,0,1,0,0,570,"Kevin Sundberg","None,None,None",10,2991.1111111111109,"William Tustin",2991.1111111111109]
["Ken Arena","Iron Duke","Flag",5,5,18,7,12,2,1,0,1,2480,"Justin Ragucci","None,None,None",9,1382.0338983050849,"Ken Arena",1182.0338983050849]
["Justin Ragucci","Blucher","No Flag",3,3.5,9,0,0,1,0,0,0,790,"Ken Arena","None,None,None",3.5,1046.8888888888889,"Justin Ragucci",1046.8888888888889]
["Robert Arena","Arizona ","No Flag",5,5.5,97,26,26,1,1,0,1,3170,"Matthew Andrews","None,None,None",9,2692,"Robert Arena",2492]
["Richard Whitsell","Jamaica","Flag",2,2.5,1,0,0,0,1,0,0,10,"Robert Arena","None,None,None",6,921.3559322033899,"Richard Whitsell",921.3559322033899]
["Matt Andrews","Baden","Flag",5,5.5,14,0,6,1,0,0,0,1220,"Robert Arena","None,None,None",4.5,691.01694915254245,"Matt Andrews",691.01694915254245]

{"sheet":"GA Feb Sat 1","index":26,"n_rows":15,"n_cols":20,"rows_kept":15,"cut":false,"hidden":false,"merged":[]}
[null,null,null,null,null,null,null,null,"Winner:",{"$f":"IF(K2>K3, B2, IF(K3>K2, B3, \"Tie\"))","v":"No Flag"},null,"Battle Type","Battle Location and Month (i.e. MD May)","GA Feb",null,null,null,null,"Fleet"]
["Fleet 1 :","Flag",null,"Fleet Units:",24.5,"Fleet Weight:",38.5,"Fleet Battle Damage:",6310,"Fleet Score:",2359.999755859375,null,"Battle Day",1,null,null,null,null,"Mini-Fleet"]
["Fleet 2 :","No Flag",null,"Fleet Units:",27.5,"Fleet Weight:",50,"Fleet Battle Damage:",3460,"Fleet Score:",6310,null,"Battle Number",1,null,null,null,null,"Individual"]
["Captian","Ship","Fleet","Class","Units","Above","On","Below","Sinks","Participate all Sorties","Penalties Points","2nd Sortie Sink","Damage Points","Scored By","Notes","Weight Factor","Weight Points","Captian","Captain Points","Indiv Points"]
["Kevin Plumer","Kongo","No Flag",4,4.5,25,6,17,0,1,0,0,880,"Lou Meszaros","None,None,None",8,1009.6,"Kevin Plumer",1009.6]
["William Harvard","Invincible","No Flag",4,4,3,0,0,0,1,0,0,30,"Jacen Winnette","None,None,None",8,1009.6,"William Harvard",1009.6]
["Bryan Box","Blucher","No Flag",3,3.5,7,0,3,0,1,0,0,160,"Matthew Andrews","None,None,None",7,883.40000000000009,"Bryan Box",883.40000000000009]
["Brian Koehler","Queen Elizabeth","No Flag",5,5.5,21,4,12,0,1,0,0,650,"Thomas Tanner","None,None,None",9,1135.8,"Brian Koehler",1135.8]
["Neil Humble","Vonn Der Tann","No Flag",4,4,33,7,29,0,1,0,0,1340,"Thomas Tanner","None,None,None",8,1009.6,"Neil Humble",1009.6]
["Steve Andrews","North Carolina","No Flag",6,6,9,2,9,0,1,0,0,400,"Lou Meszaros","None,None,None",10,1262,"Steve Andrews",1262]
["David Winette","Alabama","Flag",6,6,35,4,1,1,1,0,0,460,"Neil Humble","None,None,None",10,898.70129870129858,"David Winette",898.70129870129858]
["Jacen Winette","Invincible","Flag",4,4,30,1,12,1,1,0,0,680,"Brian Koehler","None,None,None",8,718.96103896103898,"Jacen Winette",718.96103896103898]
["Thomas Tanner","Ostfriesland","Flag",4,4.5,50,15,34,1,1,0,0,1820,"Kevin Plumer","None,None,None",8,718.96103896103898,"Thomas Tanner",718.96103896103898]
["Lou Meszaros","Courbet","Flag",4,4.5,34,15,39,1,1,200,1,2610,"Steven Andrews","Ram,None,None",8,518.96103896103898,"Lou Meszaros",318.96103896103898]
["Matt Andrews","Baden","Flag",5,5.5,14,6,16,0,0,900,0,740,"Kevin Plumer","Withdraw,None,None",4.5,-495.58441558441558,"Matt Andrews",-495.58441558441558]

{"sheet":"GA Feb Sat 2","index":27,"n_rows":17,"n_cols":20,"rows_kept":17,"cut":false,"hidden":false,"merged":[]}
[null,null,null,null,null,null,null,null,"Winner:",{"$f":"IF(K2>K3, B2, IF(K3>K2, B3, \"Tie\"))","v":"Flag"},null,"Battle Type","Battle Location and Month (i.e. MD May)","GA Feb",null,null,null,null,"Fleet"]
["Fleet 1 :","Flag",null,"Fleet Units:",31.5,"Fleet Weight:",44,"Fleet Battle Damage:",7100,"Fleet Score:",13230,null,"Battle Day","Sat",null,null,null,null,"Mini-Fleet"]
["Fleet 2 :","No Flag",null,"Fleet Units:",30.5,"Fleet Weight:",48,"Fleet Battle Damage:",13230,"Fleet Score:",7099.99951171875,null,"Battle Number",2,null,null,null,null,"Individual"]
["Captian","Ship","Fleet","Class","Units","Above","On","Below","Sinks","Participate all Sorties","Penalties Points","2nd Sortie Sink","Damage Points","Scored By","Notes","Weight Factor","Weight Points","Captian","Captain Points","Indiv Points"]
["Jacen Winette","Invincible","Flag",4,4,8,4,3,1,0,0,0,1050,"Nate Armstrong","None,None,None",4,1202.7272727272727,"Jacen Winette",1202.7272727272727]
["Jacen Winette","Alabama","Flag",6,6,29,7,2,0,0,0,0,490,"Nate Armstrong","None,None,None",5,1503.4090909090908,"Jacen Winette",1503.4090909090908]
["Thomas Tanner","Ostfriesland","Flag",4,4.5,13,6,11,1,1,0,1,1380,"Neil Humble","None,None,None",8,2405.4545454545455,"Thomas Tanner",2205.4545454545455]
["Matt Andrews","Baden","Flag",5,5.5,28,4,2,0,1,0,0,420,"Bryan Box","None,None,None",9,2706.136363636364,"Matt Andrews",2706.136363636364]
["Lou Meszaros","Courbet","Flag",4,4.5,21,14,31,0,1,0,0,1420,"Nate Armstrong","None,None,None",8,2405.4545454545455,"Lou Meszaros",2405.4545454545455]
["Kevin Plumer","Vanguard","Flag",7,7,82,13,42,0,1,0,0,2340,"William Harvard","None,None,None",10,3006.8181818181815,"Kevin Plumer",3006.8181818181815]
["Brian Koehler","Queen Elizabeth","No Flag",5,5.5,55,5,18,1,1,0,1,2090,"Nate Armstrong","None,None,None",9,1331.25,"Brian Koehler",1131.25]
["Neil Humble","Malaya","No Flag",5,5.5,55,8,24,0,1,0,0,1430,"Thomas Tanner","None,None,None",9,1331.25,"Neil Humble",1331.25]
["Steve Andrews","Iron Duke","No Flag",5,5,38,8,27,1,0,0,0,2250,"Matthew Andrews","None,None,None",4.5,665.625,"Steve Andrews",665.625]
["Bryan Box","Blucher","No Flag",3,3.5,19,5,11,1,0,0,0,1320,"Nathan Armstrong","None,None,None",3.5,517.70833333333337,"Bryan Box",517.70833333333337]
["William Harvard","Invincible","No Flag",4,4,59,4,11,0,1,0,0,1000,"Kevin Plumer","None,None,None",8,1183.3333333333333,"William Harvard",1183.3333333333333]
["Carl Bitondo","Deutschland","No Flag",3,3.5,26,11,22,2,1,0,1,2540,"Lou Meszaros","None,None,None",7,1035.4166666666667,"Carl Bitondo",835.41666666666674]
["Eric Bitondo","Deutschland","No Flag",3,3.5,16,7,30,2,1,0,1,2600,"Kevin Plumer","None,None,None",7,1035.4166666666667,"Eric Bitondo",835.41666666666674]

{"sheet":"GA Feb Sun 1","index":28,"n_rows":16,"n_cols":20,"rows_kept":16,"cut":false,"hidden":false,"merged":[]}
[null,null,null,null,null,null,null,null,"Winner:",{"$f":"IF(K2>K3, B2, IF(K3>K2, B3, \"Tie\"))","v":"Flag"},null,"Battle Type","Battle Location and Month (i.e. MD May)","GA Feb",null,null,null,null,"Fleet"]
["Fleet 1 :","Flag",null,"Fleet Units:",26.5,"Fleet Weight:",48,"Fleet Battle Damage:",5810,"Fleet Score:",8430,null,"Battle Day","Sun",null,null,null,null,"Mini-Fleet"]
["Fleet 2 :","No Flag",null,"Fleet Units:",31,"Fleet Weight:",45,"Fleet Battle Damage:",8430,"Fleet Score:",5810,null,"Battle Number",1,null,null,null,null,"Individual"]
["Captian","Ship","Fleet","Class","Units","Above","On","Below","Sinks","Participate all Sorties","Penalties Points","2nd Sortie Sink","Damage Points","Scored By","Notes","Weight Factor","Weight Points","Captian","Captain Points","Indiv Points"]
["Thomas Tanner","Ostfriesland","No Flag",4,4.5,34,9,19,0,1,0,0,1090,"Kevin Plumer","None,None,None",8,1032.8888888888889,"Thomas Tanner",1032.8888888888889]
["Steve Andrews","North Carolina","No Flag",6,6,52,10,43,0,1,0,0,2010,"Kevin Plumer","None,None,None",10,1291.1111111111111,"Steve Andrews",1291.1111111111111]
["Matt Andrews","Baden","No Flag",5,5.5,52,6,30,0,1,0,0,1540,"Nathan Armstrong","None,None,None",9,1162,"Matt Andrews",1162]
["Brian Koehler","Queen Elizabeth","No Flag",5,5.5,44,1,13,1,0,0,0,1750,"Neil Humble","None,None,None",4.5,581,"Brian Koehler",581]
["Jacen Winette","Alabama","No Flag",6,6,66,6,9,0,1,0,0,1050,"Nate Armstrong","None,None,None",10,1291.1111111111111,"Jacen Winette",1291.1111111111111]
["Carl Bitondo","Deutschland","No Flag",3,3.5,12,1,5,1,0,0,0,990,"Eric Bitondo","None,None,None",3.5,451.88888888888891,"Carl Bitondo",451.88888888888891]
["Bryan Box","Blucher","Flag",3,3.5,14,4,4,0,1,0,0,340,"Nate Armstrong","None,None,None",7,1229.375,"Bryan Box",1229.375]
["Eric Bitondo","Deutschland","Flag",3,3.5,46,10,9,1,1,0,1,1630,"Thomas Tanner","None,None,None",7,1229.375,"Eric Bitondo",1029.375]
["Nathan Armstrong","Fargo","Flag",3,3,15,2,5,0,1,0,0,340,"Jacen Winette","None,None,None",7,1229.375,"Nathan Armstrong",1229.375]
["Kevin Plumer","Vanguard","Flag",7,7,48,7,20,0,1,0,0,1220,"Steven Andrews","None,None,None",10,1756.25,"Kevin Plumer",1756.25]
["Neil Humble","Malaya","Flag",5,5.5,91,8,23,0,1,0,0,1760,"Matthew Andrews","None,None,None",9,1580.625,"Neil Humble",1580.625]
["William Harvard","Invincible","Flag",4,4,36,2,4,0,1,0,0,520,"Brian Koehler","None,None,None",8,1405,"William Harvard",1405]

{"sheet":"GA Feb SUN 2","index":29,"n_rows":18,"n_cols":20,"rows_kept":18,"cut":false,"hidden":false,"merged":[]}
[null,null,null,null,null,null,null,null,"Winner:",{"$f":"IF(K2>K3, B2, IF(K3>K2, B3, \"Tie\"))","v":"Flag"},null,"Battle Type","Battle Location and Month (i.e. MD May)","GA Feb",null,null,null,null,"Fleet"]
["Fleet 1 :","Flag",null,"Fleet Units:",26.5,"Fleet Weight:",48,"Fleet Battle Damage:",6880,"Fleet Score:",10240,null,"Battle Day","SUN",null,null,null,null,"Mini-Fleet"]
["Fleet 2 :","No Flag",null,"Fleet Units:",39.5,"Fleet Weight:",64,"Fleet Battle Damage:",10240,"Fleet Score:",5880,null,"Battle Number",2,null,null,null,null,"Individual"]
["Captian","Ship","Fleet","Class","Units","Above","On","Below","Sinks","Participate all Sorties","Penalties Points","2nd Sortie Sink","Damage Points","Scored By","Notes","Weight Factor","Weight Points","Captian","Captain Points","Indiv Points"]
["Kevin Plumer","Vanguard","Flag",7,7,89,16,18,0,1,0,0,1750,"David Winette","None,None,None",10,2133.3333333333335,"Kevin Plumer",2133.3333333333335]
["Eric Bitondo","Deutschland","Flag",3,3.5,18,6,9,1,1,0,1,1270,"Matthew Andrews","None,None,None",7,1493.3333333333335,"Eric Bitondo",1293.3333333333335]
["Bryan Box","Blucher","Flag",3,3.5,8,2,6,0,1,0,0,300,"Eric Bitondo","None,None,None",7,1493.3333333333335,"Bryan Box",1493.3333333333335]
["William Harvard","Invincible","Flag",4,4,62,4,24,0,1,0,0,1420,"Lou Meszaros","None,None,None",8,1706.6666666666665,"William Harvard",1706.6666666666665]
["Nathan Armstrong","Fargo","Flag",3,3,7,2,13,0,1,0,0,500,"Carl Bitondo","None,None,None",7,1493.3333333333335,"Nathan Armstrong",1493.3333333333335]
["Neil Humble","Malaya","Flag",5,5.5,88,11,18,0,1,0,0,1640,"Steven Andrews","None,None,None",9,1920,"Neil Humble",1920]
["David Winette","Alabama","No Flag",6,6,79,7,8,0,1,0,0,1170,"Nathan Armstrong","None,None,None",10,1075,"David Winette",1075]
["Steve Andrews","North Carolina","No Flag",6,6,73,10,27,0,1,0,0,1740,"Neil Humble","None,None,None",10,1075,"Steve Andrews",1075]
["Matt Andrews","Baden","No Flag",5,5.5,18,4,7,0,1,0,0,470,"William Harvard","None,None,None",9,967.5,"Matt Andrews",967.5]
["Lou Meszaros","Courbet","No Flag",4,4.5,22,5,7,1,1,0,1,1330,"Nate Armstrong","None,None,None",8,860,"Lou Meszaros",660]
["Jacen Winette","Alabama","No Flag",6,6,69,8,8,0,0,1000,0,1090,"Kevin Plumer","Withdraw,None,None",5,-462.5,"Jacen Winette",-462.5]
["Hazel Koehler","Moreno","No Flag",5,5.5,83,16,33,1,1,0,1,3040,"Kevin Plumer","None,None,None",9,967.5,"Hazel Koehler",767.5]
["Brian Koehler","Fiji","No Flag",2,2.5,5,0,1,0,1,0,0,80,"Kevin Plumer","None,None,None",6,645,"Brian Koehler",645]
["Carl Bitondo","Deutschland","No Flag",3,3.5,11,9,11,1,1,0,1,1320,"Eric Bitondo","None,None,None",7,752.5,"Carl Bitondo",552.5]

{"sheet":"GA Feb SUN 3","index":30,"n_rows":14,"n_cols":20,"rows_kept":14,"cut":false,"hidden":false,"merged":[]}
[null,null,null,null,null,null,null,null,"Winner:",{"$f":"IF(K2>K3, B2, IF(K3>K2, B3, \"Tie\"))","v":"Flag"},null,"Battle Type","Battle Location and Month (i.e. MD May)","GA Feb",null,null,null,null,"Fleet"]
["Fleet 1 :","Flag",null,"Fleet Units:",22.5,"Fleet Weight:",40,"Fleet Battle Damage:",5090,"Fleet Score:",8110,null,"Battle Day","SUN",null,null,null,null,"Mini-Fleet"]
["Fleet 2 :","No Flag",null,"Fleet Units:",22,"Fleet Weight:",36,"Fleet Battle Damage:",8110,"Fleet Score:",5090,null,"Battle Number",3,null,null,null,null,"Individual"]
["Captian","Ship","Fleet","Class","Units","Above","On","Below","Sinks","Participate all Sorties","Penalties Points","2nd Sortie Sink","Damage Points","Scored By","Notes","Weight Factor","Weight Points","Captian","Captain Points","Indiv Points"]
["Nathan Armstrong","Fargo","Flag",3,3,4,2,1,0,1,0,0,110,"David Winette","None,None,None",7,1419.25,"Nathan Armstrong",1419.25]
["Neil Humble","Malaya","Flag",5,5.5,63,6,23,0,1,0,0,1440,"Matthew Andrews","None,None,None",9,1824.75,"Neil Humble",1824.75]
["Kevin Plumer","Vanguard","Flag",7,7,61,7,32,0,1,0,0,1710,"Matthew Andrews","None,None,None",10,2027.5,"Kevin Plumer",2027.5]
["Bryan Box","Blucher","Flag",3,3.5,36,4,7,0,1,0,0,650,"Carl Bitondo","None,None,None",7,1419.25,"Bryan Box",1419.25]
["Eric Bitondo","Deutschland","Flag",3,3.5,16,4,8,1,1,0,1,1180,"Carl Bitondo","None,None,None",7,1419.25,"Eric Bitondo",1219.25]
["Brian Koehler","Fiji","No Flag",2,2.5,25,5,0,0,1,0,0,350,"Hazel Koehler","None,None,None",6,848.33333333333326,"Brian Koehler",848.33333333333326]
["Carl Bitondo","Deutschland","No Flag",3,3.5,36,7,5,0,1,0,0,650,"Bryan Box","None,None,None",7,989.72222222222229,"Carl Bitondo",989.72222222222229]
["Lou Meszaros","Courbet","No Flag",4,4.5,32,17,23,1,0,0,0,2150,"Eric Bitondo","None,None,None",4,565.55555555555554,"Lou Meszaros",565.55555555555554]
["Steve Andrews","North Carolina","No Flag",6,6,134,26,45,1,1,0,1,4210,"Kevin Plumer","None,None,None",10,1413.8888888888889,"Steve Andrews",1213.8888888888889]
["Matt Andrews","Baden","No Flag",5,5.5,19,7,14,0,1,0,0,750,"Neil Humble","None,None,None",9,1272.5,"Matt Andrews",1272.5]

{"sheet":"GA Feb Mon 1","index":31,"n_rows":11,"n_cols":20,"rows_kept":11,"cut":false,"hidden":false,"merged":[]}
[null,null,null,null,null,null,null,null,"Winner:",{"$f":"IF(K2>K3, B2, IF(K3>K2, B3, \"Tie\"))","v":"Flag"},null,"Battle Type","Battle Location and Month (i.e. MD May)","GA Feb",null,null,null,null,"Fleet"]
["Fleet 1 :","Flag",null,"Fleet Units:",15.5,"Fleet Weight:",26,"Fleet Battle Damage:",3840,"Fleet Score:",6060,null,"Battle Day","Mon",null,null,null,null,"Mini-Fleet"]
["Fleet 2 :","No Flag",null,"Fleet Units:",16,"Fleet Weight:",30,"Fleet Battle Damage:",6060,"Fleet Score:",3840,null,"Battle Number",1,null,null,null,null,"Individual"]
["Captian","Ship","Fleet","Class","Units","Above","On","Below","Sinks","Participate all Sorties","Penalties Points","2nd Sortie Sink","Damage Points","Scored By","Notes","Weight Factor","Weight Points","Captian","Captain Points","Indiv Points"]
["Steve Andrews","Des Moises","No Flag",3,3.5,68,11,25,1,1,0,1,2350,"Kevin Plumer","None,None,None",7,896,"Steve Andrews",696]
["Matt Andrews","Baden","No Flag",5,5.5,52,9,39,1,1,0,1,2770,"Kevin Plumer","None,None,None",9,1152,"Matt Andrews",952]
["Brian Koehler","Fiji","No Flag",2,2.5,10,0,1,0,1,0,0,130,"William Harvard","None,None,None",6,768,"Brian Koehler",768]
["Lou Meszaros","Courbet","No Flag",4,4.5,29,8,12,0,1,0,0,810,"Nate Armstrong","None,None,None",8,1024,"Lou Meszaros",1024]
["Nathan Armstrong","Courbet","Flag",4,4.5,18,5,14,0,1,0,0,700,"Lou Meszaros","None,None,None",8,1864.6153846153848,"Nathan Armstrong",1864.6153846153848]
["William Harvard","Invincible","Flag",4,4,34,5,13,0,1,0,0,830,"Brian Koehler","None,None,None",8,1864.6153846153848,"William Harvard",1864.6153846153848]
["Kevin Plumer","Vanguard","Flag",7,7,89,14,38,0,1,0,0,2310,"Matthew Andrews","None,None,None",10,2330.7692307692309,"Kevin Plumer",2330.7692307692309]

{"sheet":"MN May Sat 1","index":32,"n_rows":18,"n_cols":20,"rows_kept":18,"cut":false,"hidden":false,"merged":[]}
[null,null,null,null,null,null,null,null,"Winner:",{"$f":"IF(K2>K3, B2, IF(K3>K2, B3, \"Tie\"))","v":"Flag"},null,"Battle Type","Battle Location and Month (i.e. MD May)","MN May",null,null,null,null,"Fleet"]
["Fleet 1 :","Flag",null,"Fleet Units:",32,"Fleet Weight:",55,"Fleet Battle Damage:",6920,"Fleet Score:",10570,null,"Battle Day","Sat",null,null,null,null,"Mini-Fleet"]
["Fleet 2 :","No Flag",null,"Fleet Units:",32,"Fleet Weight:",58,"Fleet Battle Damage:",10570,"Fleet Score:",6920,null,"Battle Number",1,null,null,null,null,"Individual"]
["Captian","Ship","Fleet","Class","Units","Above","On","Below","Sinks","Participate all Sorties","Penalties Points","2nd Sortie Sink","Damage Points","Scored By","Notes","Weight Factor","Weight Points","Captian","Captain Points","Indiv Points"]
["Glenn Brandon","Caio Duilio","Flag",4,4.5,40,4,10,0,1,0,0,780,"Glenn Brandon","None,None,None",8,1537.4545454545453,"Glenn Brandon",1537.4545454545453]
["Bob Hoernemann","Nagato","Flag",6,6,22,18,35,0,1,0,0,1630,"Owen R","None,None,None",10,1921.818181818182,"Bob Hoernemann",1921.818181818182]
["Peter Ellison","Erin","Flag",4,4.5,12,2,19,0,1,0,0,730,"Peter Eillison","None,None,None",8,1537.4545454545453,"Peter Ellison",1537.4545454545453]
["Richard Whitsell","Jamaica","Flag",2,2.5,1,2,0,1,0,0,0,650,"Richard Whitsell","None,None,None",3,576.5454545454545,"Richard Whitsell",576.5454545454545]
["Owen Ronning","Moltke","Flag",4,4,5,0,16,1,1,0,1,1330,"Owen Ronning","None,None,None",8,1537.4545454545453,"Owen Ronning",1337.4545454545453]
["Matthew Larson","Seydlitz","Flag",4,4.5,8,3,9,0,1,0,0,410,"Matthew Larson","None,None,None",8,1537.4545454545453,"Matthew Larson",1537.4545454545453]
["Zach Hoernemann","Nagato","Flag",6,6,54,2,27,0,1,0,0,1390,"Zach Hoernemann","None,None,None",10,1921.818181818182,"Zach Hoernemann",1921.818181818182]
["McCoy Helland","Queen Elizabeth","No Flag",5,5.5,62,20,29,0,1,0,0,1890,"McCoy Helland","None,None,None",9,1073.7931034482758,"McCoy Helland",1073.7931034482758]
["Tom Palmer","Alaska","No Flag",4,4.5,38,12,27,1,1,0,1,2230,"Tom Palmer","None,None,None",8,954.48275862068965,"Tom Palmer",754.48275862068965]
["Andy Terpstra","Nagato","No Flag",6,6,89,27,42,0,1,0,0,2690,"Glenn Brandon","None,None,None",10,1193.1034482758621,"Andy Terpstra",1193.1034482758621]
["Mike Smith","Seydlitz","No Flag",4,4.5,25,7,4,1,1,0,1,1310,"Mike Smith","None,None,None",8,954.48275862068965,"Mike Smith",754.48275862068965]
["Etta Helland","Minneapolis","No Flag",3,3,12,2,9,1,1,0,1,1130,"Tyler Helland","None,None,None",7,835.17241379310349,"Etta Helland",635.17241379310349]
["Tyler Helland","Queen Elizabeth","No Flag",5,5.5,73,2,11,0,1,0,0,1100,"Tyler Helland","None,None,None",9,1073.7931034482758,"Tyler Helland",1073.7931034482758]
["Chris Pearce","Furutaka","No Flag",3,3,5,1,5,0,1,0,0,220,"Chris Pearce","None,None,None",7,835.17241379310349,"Chris Pearce",835.17241379310349]

{"sheet":"MN May Sat 2","index":33,"n_rows":19,"n_cols":20,"rows_kept":19,"cut":false,"hidden":false,"merged":[]}
[null,null,null,null,null,null,null,null,"Winner:",{"$f":"IF(K2>K3, B2, IF(K3>K2, B3, \"Tie\"))","v":"Flag"},null,"Battle Type","Battle Location and Month (i.e. MD May)","MN May",null,null,null,null,"Fleet"]
["Fleet 1 :","Flag",null,"Fleet Units:",32,"Fleet Weight:",58,"Fleet Battle Damage:",6830,"Fleet Score:",10420,null,"Battle Day","Sat",null,null,null,null,"Mini-Fleet"]
["Fleet 2 :","No Flag",null,"Fleet Units:",35,"Fleet Weight:",61.5,"Fleet Battle Damage:",10420,"Fleet Score:",6130,null,"Battle Number",2,null,null,null,null,"Individual"]
["Captian","Ship","Fleet","Class","Units","Above","On","Below","Sinks","Participate all Sorties","Penalties Points","2nd Sortie Sink","Damage Points","Scored By","Notes","Weight Factor","Weight Points","Captian","Captain Points","Indiv Points"]
["Peter Ellison","Erin","Flag",4,4.5,12,5,11,0,1,0,0,550,"Tyler Helland","None,None,None",8,1437.2413793103449,"Peter Ellison",1437.2413793103449]
["Bob Hoernemann","Nagato","Flag",6,6,25,11,30,0,1,0,0,1370,"Flag","None,None,None",10,1796.5517241379312,"Bob Hoernemann",1796.5517241379312]
["Matthew Larson","Seydlitz","Flag",4,4.5,12,6,8,1,1,0,1,1280,"Matthew Larson","None,None,None",8,1437.2413793103449,"Matthew Larson",1237.2413793103449]
["Richard Whitsell","Jamaica","Flag",2,2.5,1,0,1,0,1,0,0,40,"Richard Whitsell","None,None,None",6,1077.9310344827586,"Richard Whitsell",1077.9310344827586]
["Zach Hoernemann","Nagato","Flag",6,6,33,5,28,0,1,0,0,1270,"Zach Hoernemann","None,None,None",10,1796.5517241379312,"Zach Hoernemann",1796.5517241379312]
["Glenn Brandon","Caio Duilio","Flag",4,4.5,29,3,11,0,1,0,0,680,"Glenn Brandon","None,None,None",8,1437.2413793103449,"Glenn Brandon",1437.2413793103449]
["Owen Ronning","Moltke","Flag",4,4,31,10,11,1,1,0,1,1640,"Owen Ronning","None,None,None",8,1437.2413793103449,"Owen Ronning",1237.2413793103449]
["Andy Terpstra","Nagato","No Flag",6,6,53,10,27,0,1,0,0,1540,"Mike Smith","None,None,None",10,1110.5691056910568,"Andy Terpstra",1110.5691056910568]
["Mike Smith","Seydlitz","No Flag",4,4.5,33,10,33,1,1,0,1,2320,"Tyler Helland","None,None,None",8,888.45528455284557,"Mike Smith",688.45528455284557]
["Chris Pearce","Furutaka","No Flag",3,3,1,1,4,1,1,0,1,850,"Brandon Smith","None,None,None",7,777.39837398373982,"Chris Pearce",577.39837398373982]
["Tom Palmer","Alaska","No Flag",4,4.5,76,12,20,0,1,0,0,1600,"Tom Palmer","None,None,None",8,888.45528455284557,"Tom Palmer",888.45528455284557]
["Kevin Bray","Moltke","No Flag",4,4,2,0,0,0,1,0,0,20,"Kevin Bray","None,None,None",8,888.45528455284557,"Kevin Bray",888.45528455284557]
["Tyler Helland","Derfflinger","No Flag",4,4.5,41,16,19,2,1,0,1,2900,"Tyler Helland","None,None,None",8,888.45528455284557,"Tyler Helland",688.45528455284557]
["McCoy Helland","Queen Elizabeth","No Flag",5,5.5,50,6,7,0,1,0,0,830,"McCoy Helland","None,None,None",9,999.51219512195121,"McCoy Helland",999.51219512195121]
["Etta Helland","Tourville","No Flag",3,3,16,4,4,0,0,700,0,360,"Tyler Helland","Withdraw,None,None",3.5,-311.30081300813009,"Etta Helland",-311.30081300813009]

{"sheet":"MN May Sat 3","index":34,"n_rows":17,"n_cols":20,"rows_kept":17,"cut":false,"hidden":false,"merged":[]}
[null,null,null,null,null,null,null,null,"Winner:",{"$f":"IF(K2>K3, B2, IF(K3>K2, B3, \"Tie\"))","v":"Flag"},null,"Battle Type","Battle Location and Month (i.e. MD May)","MN May",null,null,null,null,"Fleet"]
["Fleet 1 :","Flag",null,"Fleet Units:",28,"Fleet Weight:",46,"Fleet Battle Damage:",7470,"Fleet Score:",10020,null,"Battle Day","Sat",null,null,null,null,"Mini-Fleet"]
["Fleet 2 :","No Flag",null,"Fleet Units:",33,"Fleet Weight:",59,"Fleet Battle Damage:",10820,"Fleet Score:",7470,null,"Battle Number",3,null,null,null,null,"Individual"]
["Captian","Ship","Fleet","Class","Units","Above","On","Below","Sinks","Participate all Sorties","Penalties Points","2nd Sortie Sink","Damage Points","Scored By","Notes","Weight Factor","Weight Points","Captian","Captain Points","Indiv Points"]
["Richard Whitsell","Jamaica","Flag",2,2.5,4,0,0,0,1,0,0,40,"Richard Whitsell","None,None,None",6,1411.304347826087,"Richard Whitsell",1411.304347826087]
["Matthew Larson","Seydlitz","Flag",4,4.5,18,7,14,0,1,0,0,740,"Matthew Larson","None,None,None",8,1881.7391304347825,"Matthew Larson",1881.7391304347825]
["Tom Palmer","Alaska","Flag",4,4.5,41,10,25,0,1,0,0,1360,"Tom Palmer","None,None,None",8,1881.7391304347825,"Tom Palmer",1881.7391304347825]
["Bob Hoernemann","Nagato","Flag",6,6,39,22,19,0,1,0,0,1400,"Bob Hoernemann","None,None,None",10,2352.173913043478,"Bob Hoernemann",2352.173913043478]
["Andy Terpstra","Nagato","Flag",6,6,67,18,44,1,1,0,1,3350,"Bob Hoernemann","None,None,None",10,2352.173913043478,"Andy Terpstra",2152.173913043478]
["Glenn Brandon","Caio Duilio","Flag",4,4.5,31,3,7,0,0,800,0,580,"Glenn Brandon","Withdraw,None,None",4,140.86956521739125,"Glenn Brandon",140.86956521739125]
["McCoy Helland","Queen Elizabeth","No Flag",5,5.5,64,9,24,0,1,0,0,1540,"McCoy Helland","None,None,None",9,1139.4915254237289,"McCoy Helland",1139.4915254237289]
["Tyler Helland","Derfflinger","No Flag",4,4.5,24,12,24,1,1,0,1,2000,"Tyler Helland","None,None,None",8,1012.8813559322034,"Tyler Helland",812.88135593220341]
["Peter Ellison","Erin","No Flag",4,4.5,45,7,7,0,1,0,0,800,"Peter Ellison","None,None,None",8,1012.8813559322034,"Peter Ellison",1012.8813559322034]
["Zach Hoernemann","Nagato","No Flag",6,6,39,5,36,0,1,0,0,1570,"Zach Hoernemann","None,None,None",10,1266.1016949152543,"Zach Hoernemann",1266.1016949152543]
["Kevin Bray","Moltke","No Flag",4,4,13,0,6,0,1,0,0,310,"Kevin Bray","None,None,None",8,1012.8813559322034,"Kevin Bray",1012.8813559322034]
["Owen Ronning","Moltke","No Flag",4,4,34,13,8,1,1,0,1,1640,"Owen Ronning","None,None,None",8,1012.8813559322034,"Owen Ronning",812.88135593220341]
["Mike Smith","Seydlitz","No Flag",4,4.5,32,10,28,2,1,0,1,2960,"Mike Smith","None,None,None",8,1012.8813559322034,"Mike Smith",812.88135593220341]

{"sheet":"MN May Sun 1","index":35,"n_rows":16,"n_cols":20,"rows_kept":16,"cut":false,"hidden":false,"merged":[]}
[null,null,null,null,null,null,null,null,"Winner:",{"$f":"IF(K2>K3, B2, IF(K3>K2, B3, \"Tie\"))","v":"No Flag"},null,"Battle Type","Battle Location and Month (i.e. MD May)","MN May",null,null,null,null,"Fleet"]
["Fleet 1 :","Flag",null,"Fleet Units:",28,"Fleet Weight:",46,"Fleet Battle Damage:",6580,"Fleet Score:",6530.00048828125,null,"Battle Day","Sun",null,null,null,null,"Mini-Fleet"]
["Fleet 2 :","No Flag",null,"Fleet Units:",28.5,"Fleet Weight:",47.5,"Fleet Battle Damage:",6530,"Fleet Score:",6580,null,"Battle Number",1,null,null,null,null,"Individual"]
["Captian","Ship","Fleet","Class","Units","Above","On","Below","Sinks","Participate all Sorties","Penalties Points","2nd Sortie Sink","Damage Points","Scored By","Notes","Weight Factor","Weight Points","Captian","Captain Points","Indiv Points"]
["Glenn Brandon","Caio Duilio","Flag",4,4.5,31,3,5,0,1,0,0,520,"Glenn Brandon","None,None,None",8,1135.6521739130435,"Glenn Brandon",1135.6521739130435]
["Richard Whitsell","Jamaica","Flag",2,2.5,4,0,0,0,1,0,0,40,"Richard Whitsell","None,None,None",6,851.73913043478262,"Richard Whitsell",851.73913043478262]
["Tom Palmer","Alaska","Flag",4,4.5,31,14,32,0,1,0,0,1550,"Tom Palmer","None,None,None",8,1135.6521739130435,"Tom Palmer",1135.6521739130435]
["Peter Ellison","Erin","Flag",4,4.5,47,13,18,0,0,0,0,1270,"Mike Smith","None,None,None",4,567.82608695652175,"Peter Ellison",567.82608695652175]
["Zach Hoernemann","Nagato","Flag",6,6,52,3,24,0,1,0,0,1300,"Zach Hoeremann","None,None,None",10,1419.5652173913043,"Zach Hoernemann",1419.5652173913043]
["Bob Hoernemann","Nagato","Flag",6,6,31,21,39,0,1,0,0,1900,"Bob Hoernemann","None,None,None",10,1419.5652173913043,"Bob Hoernemann",1419.5652173913043]
["Kevin Bray","Moltke","No Flag",4,4,5,3,4,0,1,0,0,230,"Kevin Bray","None,None,None",8,1108.2105263157894,"Kevin Bray",1108.2105263157894]
["Chris Pearce","Tourville","No Flag",3,3,0,0,3,1,0,0,0,790,"Chris Pearce","None,None,None",3.5,484.84210526315786,"Chris Pearce",484.84210526315786]
["Matthew Larson","Seydlitz","No Flag",4,4.5,17,6,5,1,1,0,1,1240,"Seydlitz","None,None,None",8,1108.2105263157894,"Matthew Larson",908.21052631578937]
["McCoy Helland","Queen Elizabeth","No Flag",5,5.5,57,10,27,0,1,0,0,1580,"McCoy Helland","None,None,None",9,1246.7368421052631,"McCoy Helland",1246.7368421052631]
["Tyler Helland","Queen Elizabeth","No Flag",5,5.5,56,2,18,0,1,0,0,1140,"Tyler Helland","None,None,None",9,1246.7368421052631,"Tyler Helland",1246.7368421052631]
["Andy Terpstra","Nagato","No Flag",6,6,34,14,31,0,1,0,0,1550,"Andy Terpstra","None,None,None",10,1385.2631578947369,"Andy Terpstra",1385.2631578947369]

{"sheet":"MN May Sun 2","index":36,"n_rows":17,"n_cols":20,"rows_kept":17,"cut":false,"hidden":false,"merged":[]}
[null,null,null,null,null,null,null,null,"Winner:",{"$f":"IF(K2>K3, B2, IF(K3>K2, B3, \"Tie\"))","v":"Flag"},null,"Battle Type","Battle Location and Month (i.e. MD May)","MN May",null,null,null,null,"Fleet"]
["Fleet 1 :","Flag",null,"Fleet Units:",32.5,"Fleet Weight:",50,"Fleet Battle Damage:",12580,"Fleet Score:",14500,null,"Battle Day","Sun",null,null,null,null,"Mini-Fleet"]
["Fleet 2 :","No Flag",null,"Fleet Units:",30,"Fleet Weight:",47.5,"Fleet Battle Damage:",14500,"Fleet Score:",11680,null,"Battle Number",2,null,null,null,null,"Individual"]
["Captian","Ship","Fleet","Class","Units","Above","On","Below","Sinks","Participate all Sorties","Penalties Points","2nd Sortie Sink","Damage Points","Scored By","Notes","Weight Factor","Weight Points","Captian","Captain Points","Indiv Points"]
["Peter Ellison","Erin","Flag",4,4.5,52,17,23,1,1,0,1,2350,"Peter Ellison","None,None,None",8,2320,"Peter Ellison",2120]
["Richard Whitsell","Jamaica","Flag",2,2.5,1,0,0,0,1,0,0,10,"Richard Whitsell","None,None,None",6,1740,"Richard Whitsell",1740]
["Glenn Brandon","Caio Duilio","Flag",4,4.5,36,9,10,1,0,0,0,1640,"Glenn Brandon","None,None,None",4,1160,"Glenn Brandon",1160]
["Mike Smith","Seydlitz","Flag",4,4.5,28,8,24,0,0,0,0,1160,"Mike Smith","None,None,None",4,1160,"Mike Smith",1160]
["Zach Hoernemann","Nagato","Flag",6,6,65,7,34,1,1,0,1,2810,"Zach Hoernemann","None,None,None",10,2900,"Zach Hoernemann",2700]
["Tom Palmer","Alaska","Flag",4,4.5,37,11,36,1,1,0,1,2470,"Tom Palmer","None,None,None",8,2320,"Tom Palmer",2120]
["Bob Hoernemann","Nagato","Flag",6,6,47,22,41,0,1,0,0,2140,"Bob Hoernemann","None,None,None",10,2900,"Bob Hoernemann",2900]
["Matthew Larson","Seydlitz","No Flag",4,4.5,12,8,10,2,1,0,1,2180,"Matthew Larson","None,None,None",8,2118.7368421052629,"Matthew Larson",1918.7368421052629]
["Tyler Helland","Queen Elizabeth","No Flag",5,5.5,41,1,9,0,0,900,0,700,"Tyler Helland","Withdraw,None,None",4.5,291.78947368421063,"Tyler Helland",291.78947368421063]
["McCoy Helland","Queen Elizabeth","No Flag",5,5.5,59,9,27,0,1,0,0,1580,"McCoy Helland","None,None,None",9,2383.5789473684213,"McCoy Helland",2383.5789473684213]
["Tyler Helland","Derfflinger","No Flag",4,4.5,40,7,20,2,1,0,1,2740,"Tyler Helland","None,None,None",8,2118.7368421052629,"Tyler Helland",1918.7368421052629]
["Owen Ronning","Moltke","No Flag",4,4,103,15,11,2,1,0,1,3260,"Owen Ronning","None,None,None",8,2118.7368421052629,"Owen Ronning",1918.7368421052629]
["Andy Terpstra","Nagato","No Flag",6,6,95,52,35,1,1,0,1,4040,"Andy Terpstra","None,None,None",10,2648.4210526315787,"Andy Terpstra",2448.4210526315787]

{"sheet":"NJ May Fri 1","index":37,"n_rows":17,"n_cols":20,"rows_kept":17,"cut":false,"hidden":false,"merged":[]}
[null,null,null,null,null,null,null,null,"Winner:",{"$f":"IF(K2>K3, B2, IF(K3>K2, B3, \"Tie\"))","v":"Green"},null,"Battle Type","Battle Location and Month (i.e. MD May)","NJ May",null,null,null,null,"Fleet"]
["Fleet 1 :","Green",null,"Fleet Units:",32.5,"Fleet Weight:",44.5,"Fleet Battle Damage:",10600,"Fleet Score:",16520,null,"Battle Day","Fri",null,null,null,null,"Mini-Fleet"]
["Fleet 2 :","Orange",null,"Fleet Units:",33.5,"Fleet Weight:",53.5,"Fleet Battle Damage:",16520,"Fleet Score:",10600,null,"Battle Number",1,null,null,null,null,"Individual"]
["Captian","Ship","Fleet","Class","Units","Above","On","Below","Sinks","Participate all Sorties","Penalties Points","2nd Sortie Sink","Damage Points","Scored By","Notes","Weight Factor","Weight Points","Captian","Captain Points","Indiv Points"]
["William Tustin","Mackenson","Green",5,5,0,0,46,1,0,0,0,2280,"Will Tustin","None,None,None",4.5,1670.5617977528088,"William Tustin",1670.5617977528088]
["Steve Andrews","North Carolina","Green",6,6,23,4,8,0,0,0,0,550,"Ginger Andrews","None,None,None",5,1856.1797752808989,"Steve Andrews",1856.1797752808989]
["Kevin Plumer","Iowa","Green",7,8,111,20,62,0,1,0,0,3370,"Justin R","None,None,None",10,3712.3595505617977,"Kevin Plumer",3712.3595505617977]
["Brian Koehler","Queen Elizabeth","Green",5,5.5,50,1,6,1,1,0,1,1600,"Robert Arena","None,None,None",9,3341.1235955056177,"Brian Koehler",3141.1235955056177]
["Matthew Moury","Nassau","Green",4,4,18,0,17,0,1,0,0,690,"Thomas Tanner","None,None,None",8,2969.8876404494381,"Matthew Moury",2969.8876404494381]
["Mattie Vezquez","Viribus Unitas","Green",4,4,18,7,33,1,1,0,1,2110,"Thomas Tanner","None,None,None",8,2969.8876404494381,"Mattie Vezquez",2769.8876404494381]
["Ginger Andrews","Des Moises","Orange",3,3.5,11,2,4,0,1,0,0,270,"Steven Andrews","None,None,None",7,1386.9158878504672,"Ginger Andrews",1386.9158878504672]
["Thomas Tanner","Ostfriesland","Orange",4,4.5,33,2,27,1,1,0,1,1980,"Ken Arena","None,None,None",8,1585.0467289719625,"Thomas Tanner",1385.0467289719625]
["Caleb Smith","Arizona","Orange",5,5.5,86,24,100,1,1,0,1,5240,"Nate Armstrong","None,None,None",9,1783.1775700934579,"Caleb Smith",1583.1775700934579]
["Robert Arena","Arizona","Orange",5,5.5,64,18,29,2,1,0,1,3670,"Brian Koehler","None,None,None",9,1783.1775700934579,"Robert Arena",1583.1775700934579]
["Justin Ragucci","Blucher","Orange",3,3.5,8,2,3,1,1,0,1,910,"Kevin Plumer","None,None,None",7,1386.9158878504672,"Justin Ragucci",1186.9158878504672]
["Ken Arena","Iron Duke","Orange",5,5.5,1,2,15,2,1,0,1,2300,"Kevin Plumer","None,None,None",9,1783.1775700934579,"Ken Arena",1583.1775700934579]
["Matt Andrews","Baden","Orange",5,5.5,33,7,26,1,0,0,0,2150,"Matti Vezquez","None,None,None",4.5,891.58878504672896,"Matt Andrews",891.58878504672896]

{"sheet":"NJ May Fri 2","index":38,"n_rows":18,"n_cols":20,"rows_kept":18,"cut":false,"hidden":false,"merged":[]}
[null,null,null,null,null,null,null,null,"Winner:",{"$f":"IF(K2>K3, B2, IF(K3>K2, B3, \"Tie\"))","v":"Green"},null,"Battle Type","Battle Location and Month (i.e. MD May)","NJ May",null,null,null,null,"Fleet"]
["Fleet 1 :","Green",null,"Fleet Units:",43.5,"Fleet Weight:",68,"Fleet Battle Damage:",9160,"Fleet Score:",12630,null,"Battle Day","Fri",null,null,null,null,"Mini-Fleet"]
["Fleet 2 :","Orange",null,"Fleet Units:",29,"Fleet Weight:",50,"Fleet Battle Damage:",13330,"Fleet Score:",9159.9990234375,null,"Battle Number",2,null,null,null,null,"Individual"]
["Captian","Ship","Fleet","Class","Units","Above","On","Below","Sinks","Participate all Sorties","Penalties Points","2nd Sortie Sink","Damage Points","Scored By","Notes","Weight Factor","Weight Points","Captian","Captain Points","Indiv Points"]
["Kevin Plumer","Courbet","Green",4,4.5,43,8,28,0,1,0,0,1430,"Matthew Andrews","None,None,None",8,1568.2352941176471,"Kevin Plumer",1568.2352941176471]
["Ryan Szimanski","Iowa","Green",7,8,46,16,39,0,1,0,0,1950,"Matthew Andrews","None,None,None",10,1960.2941176470588,"Ryan Szimanski",1960.2941176470588]
["Steve Andrews","North Carolina","Green",6,6,47,4,25,0,1,0,0,1300,"Caleb Smith","None,None,None",10,1960.2941176470588,"Steve Andrews",1960.2941176470588]
["Mattie Vezquez","Viribus Unitas","Green",4,4,16,0,1,1,1,0,1,990,"Thomas Tanner","None,None,None",8,1568.2352941176471,"Mattie Vezquez",1368.2352941176471]
["William Tustin","Mackenson","Green",5,5,20,9,23,1,1,0,1,1970,"Caleb Smith","None,None,None",9,1764.2647058823529,"William Tustin",1564.2647058823529]
["Matthew Moury","Nassau","Green",4,4,11,2,9,0,0,0,0,420,"Thomas Tanner","None,None,None",4,784.11764705882354,"Matthew Moury",784.11764705882354]
["Nathan Armstrong","Indiana","Green",6,6.5,43,2,5,0,1,700,0,620,"Ginger Andrews","Ram - Sink,None,None",10,1260.2941176470588,"Nathan Armstrong",1260.2941176470588]
["Brian Koehler","Queen Elizabeth","Green",5,5.5,27,0,7,0,1,0,0,480,"Ken Arena","None,None,None",9,1764.2647058823529,"Brian Koehler",1764.2647058823529]
["Ginger Andrews","Des Moises","Orange",3,3.5,5,1,3,0,1,0,0,160,"Steven Andrews","None,None,None",7,1282.4000000000001,"Ginger Andrews",1282.4000000000001]
["Robert Arena","Arizona","Orange",5,5.5,32,4,22,2,1,0,1,2860,"Matt Moury","None,None,None",9,1648.8,"Robert Arena",1448.8]
["Matt Andrews","Erin","Orange",4,4.5,83,5,23,1,1,0,1,2420,"Kevin Plumer","None,None,None",8,1465.6000000000001,"Matt Andrews",1265.6000000000001]
["Ken Arena","Iron Duke","Orange",5,5.5,3,1,14,2,1,0,1,2270,"Brian Koehler","None,None,None",9,1648.8,"Ken Arena",1448.8]
["Caleb Smith","Arizona","Orange",5,5.5,98,23,62,1,1,0,1,4200,"Nate Armstrong","None,None,None",9,1648.8,"Caleb Smith",1448.8]
["Thomas Tanner","Ostfriesland","Orange",4,4.5,58,12,20,0,1,0,0,1420,"Matt Moury","None,None,None",8,1465.6000000000001,"Thomas Tanner",1465.6000000000001]

{"sheet":"NJ May Sat 1","index":39,"n_rows":19,"n_cols":20,"rows_kept":19,"cut":false,"hidden":false,"merged":[]}
[null,null,null,null,null,null,null,null,"Winner:",{"$f":"IF(K2>K3, B2, IF(K3>K2, B3, \"Tie\"))","v":"Orange"},null,"Battle Type","Battle Location and Month (i.e. MD May)","NJ May",null,null,null,null,"Fleet"]
["Fleet 1 :","Orange",null,"Fleet Units:",40.5,"Fleet Weight:",68,"Fleet Battle Damage:",8700,"Fleet Score:",12210,null,"Battle Day","Sat",null,null,null,null,"Mini-Fleet"]
["Fleet 2 :","Green",null,"Fleet Units:",35.5,"Fleet Weight:",62,"Fleet Battle Damage:",12610,"Fleet Score:",8700,null,"Battle Number",1,null,null,null,null,"Individual"]
["Captian","Ship","Fleet","Class","Units","Above","On","Below","Sinks","Participate all Sorties","Penalties Points","2nd Sortie Sink","Damage Points","Scored By","Notes","Weight Factor","Weight Points","Captian","Captain Points","Indiv Points"]
["Ginger Andrews","Des Moises","Orange",3,3.5,4,0,0,0,1,0,0,40,"Brian Koehler","None,None,None",7,1298.0882352941176,"Ginger Andrews",1298.0882352941176]
["Matt Andrews","Baden","Orange",5,5.5,37,7,11,1,1,0,1,1740,"Matt Moury","None,None,None",9,1668.9705882352941,"Matt Andrews",1468.9705882352941]
["Ken Arena","Iron Duke","Orange",5,5.5,17,5,17,0,1,0,0,780,"Brian Koehler","None,None,None",9,1668.9705882352941,"Ken Arena",1668.9705882352941]
["Robert Arena","Arizona","Orange",5,5.5,78,9,37,1,1,0,1,2970,"Brian Koehler","None,None,None",9,1668.9705882352941,"Robert Arena",1468.9705882352941]
["Kevin Plumer","Vanguard","Orange",7,7,20,2,11,0,1,0,0,570,"Amanda Tustin","None,None,None",10,1854.4117647058824,"Kevin Plumer",1854.4117647058824]
["Justin Ragucci","Blucher","Orange",3,3.5,1,0,1,0,1,0,0,40,"Kevin Plumer","None,None,None",7,1298.0882352941176,"Justin Ragucci",1298.0882352941176]
["Caleb Smith","Arizona","Orange",5,5.5,58,7,21,0,1,0,0,1350,"William Tustin","None,None,None",9,1668.9705882352941,"Caleb Smith",1668.9705882352941]
["Thomas Tanner","Ostfriesland","Orange",4,4.5,22,9,27,0,1,400,0,1210,"Matt Moury","Ram - Below,Ram - Below,None",8,1083.5294117647059,"Thomas Tanner",1083.5294117647059]
["Mattie Vezquez","Viribus Unitas","Green",4,4,10,2,5,0,1,0,0,290,"Kevin Plumer","None,None,None",8,1122.5806451612902,"Mattie Vezquez",1122.5806451612902]
["Matthew Moury","Nassau","Green",4,4,6,0,4,2,1,0,1,1780,"Kevin Plumer","None,None,None",8,1122.5806451612902,"Matthew Moury",922.58064516129025]
["Steve Andrews","North Carolina","Green",6,6,50,5,12,0,1,0,0,960,"Ginger Andrews","None,None,None",10,1403.2258064516129,"Steve Andrews",1403.2258064516129]
["Brian Koehler","Queen Elizabeth","Green",5,5.5,53,0,27,0,1,0,0,1340,"Ken Arena","None,None,None",9,1262.9032258064517,"Brian Koehler",1262.9032258064517]
["Amanda Seltzer","South Carolina","Green",4,4.5,16,6,28,0,1,0,0,1120,"Caleb Smith","None,None,None",8,1122.5806451612902,"Amanda Seltzer",1122.5806451612902]
["William Tustin","Mackenson","Green",5,5,61,13,53,2,1,0,1,4260,"Mattie Vezquez","None,None,None",9,1262.9032258064517,"William Tustin",1062.9032258064517]
["Kevin Sundberg","Indiana","Green",6,6.5,62,11,34,1,1,0,1,2860,"Mattie Vezquez","None,None,None",10,1403.2258064516129,"Kevin Sundberg",1203.2258064516129]

{"sheet":"NJ May Sat 2","index":40,"n_rows":18,"n_cols":20,"rows_kept":18,"cut":false,"hidden":false,"merged":[]}
[null,null,null,null,null,null,null,null,"Winner:",{"$f":"IF(K2>K3, B2, IF(K3>K2, B3, \"Tie\"))","v":"Orange"},null,"Battle Type","Battle Location and Month (i.e. MD May)","NJ May",null,null,null,null,"Fleet"]
["Fleet 1 :","Green",null,"Fleet Units:",40,"Fleet Weight:",70,"Fleet Battle Damage:",13470,"Fleet Score:",4270,null,"Battle Day","Sat",null,null,null,null,"Mini-Fleet"]
["Fleet 2 :","Orange",null,"Fleet Units:",31.5,"Fleet Weight:",52,"Fleet Battle Damage:",5270,"Fleet Score:",13470,null,"Battle Number",2,null,null,null,null,"Individual"]
["Captian","Ship","Fleet","Class","Units","Above","On","Below","Sinks","Participate all Sorties","Penalties Points","2nd Sortie Sink","Damage Points","Scored By","Notes","Weight Factor","Weight Points","Captian","Captain Points","Indiv Points"]
["Ken Arena","Iron Duke","Orange",5,5.5,14,2,8,0,1,0,0,420,"Ginger Andrews","None,None,None",9,2331.3461538461538,"Ken Arena",2331.3461538461538]
["Robert Arena","Arizona","Orange",5,5.5,31,3,14,0,1,0,0,790,"Amanda Tustin","None,None,None",9,2331.3461538461538,"Robert Arena",2331.3461538461538]
["Kevin Plumer","Vanguard","Orange",7,7,61,12,30,0,1,0,0,1750,"Kevin Sundberg","None,None,None",10,2590.3846153846157,"Kevin Plumer",2590.3846153846157]
["Thomas Tanner","Ostfriesland","Orange",4,4.5,36,10,15,0,1,0,0,1010,"Mattie Vezquez","None,None,None",8,2072.3076923076924,"Thomas Tanner",2072.3076923076924]
["Justin Ragucci","Blucher","Orange",3,3.5,15,3,6,0,1,0,0,390,"Matt Moury","None,None,None",7,1813.2692307692307,"Justin Ragucci",1813.2692307692307]
["Caleb Smith","Arizona","Orange",5,5.5,29,7,16,0,1,0,0,910,"Nate Armstrong","None,None,None",9,2331.3461538461538,"Caleb Smith",2331.3461538461538]
["Amanda Seltzer","South Carolina","Green",4,4.5,20,5,4,0,1,0,0,420,"Robert Arena","None,None,None",8,602.28571428571422,"Amanda Seltzer",602.28571428571422]
["Steve Andrews","North Carolina","Green",6,6,34,4,18,0,1,1000,0,960,"Caleb Smith","Withdraw,None,None",10,-247.14285714285722,"Steve Andrews",-247.14285714285722]
["Kevin Sundberg","Indiana","Green",6,6.5,114,18,35,1,1,0,1,3550,"Kevin Plumer","None,None,None",10,752.85714285714278,"Kevin Sundberg",552.85714285714278]
["William Tustin","Mackenson","Green",5,5,39,5,27,1,1,0,1,2200,"Ken Arena","None,None,None",9,677.57142857142856,"William Tustin",477.57142857142856]
["Brian Koehler","Queen Elizabeth","Green",5,5.5,68,6,29,1,1,0,1,2570,"Nate Armstrong","None,None,None",9,677.57142857142856,"Brian Koehler",477.57142857142856]
["Matt Andrews","Erin","Green",4,4.5,31,1,3,0,1,0,0,420,"Caleb Smith","None,None,None",8,602.28571428571422,"Matt Andrews",602.28571428571422]
["Matthew Moury","Nassau","Green",4,4,29,3,28,1,1,0,1,1990,"Kevin Plumer","None,None,None",8,602.28571428571422,"Matthew Moury",402.28571428571422]
["Mattie Vezquez","Viribus Unitas","Green",4,4,21,4,9,1,1,0,1,1360,"Kevin Plumer","None,None,None",8,602.28571428571422,"Mattie Vezquez",402.28571428571422]

{"sheet":"NJ May Sun 1","index":41,"n_rows":14,"n_cols":20,"rows_kept":14,"cut":false,"hidden":false,"merged":[]}
[null,null,null,null,null,null,null,null,"Winner:",{"$f":"IF(K2>K3, B2, IF(K3>K2, B3, \"Tie\"))","v":"Orange"},null,"Battle Type","Battle Location and Month (i.e. MD May)","NJ May",null,null,null,null,"Fleet"]
["Fleet 1 :","Green",null,"Fleet Units:",25.5,"Fleet Weight:",45,"Fleet Battle Damage:",11310,"Fleet Score:",6720.00048828125,null,"Battle Day","Sun",null,null,null,null,"Mini-Fleet"]
["Fleet 2 :","Orange",null,"Fleet Units:",26,"Fleet Weight:",43,"Fleet Battle Damage:",6720,"Fleet Score:",11110,null,"Battle Number",1,null,null,null,null,"Individual"]
["Captian","Ship","Fleet","Class","Units","Above","On","Below","Sinks","Participate all Sorties","Penalties Points","2nd Sortie Sink","Damage Points","Scored By","Notes","Weight Factor","Weight Points","Captian","Captain Points","Indiv Points"]
["Caleb Smith","Arizona","Orange",5,5.5,78,17,32,1,1,0,1,2980,"Kevin Sundberg","None,None,None",9,2367.2093023255816,"Caleb Smith",2167.2093023255816]
["Ginger Andrews","Des Moises","Orange",3,3.5,4,0,0,0,1,0,0,40,"Kevin Plumer","None,None,None",7,1841.1627906976746,"Ginger Andrews",1841.1627906976746]
["Robert Arena","Arizona","Orange",5,5.5,42,5,9,0,1,0,0,790,"Steven Andrews","None,None,None",9,2367.2093023255816,"Robert Arena",2367.2093023255816]
["Thomas Tanner","Ostfriesland","Orange",4,4.5,12,3,6,0,1,200,0,360,"Kevin Plumer","Ram - Below,None,None",8,1904.1860465116279,"Thomas Tanner",1904.1860465116279]
["Kevin Plumer","Vanguard","Orange",7,7,65,11,56,0,1,0,0,2550,"William Tustin","None,None,None",10,2630.2325581395348,"Kevin Plumer",2630.2325581395348]
["Matthew Moury","Nassau","Green",4,4,13,1,9,2,1,0,1,2020,"Thomas Tanner","None,None,None",8,1194.6666666666667,"Matthew Moury",994.66666666666674]
["Steve Andrews","North Carolina","Green",6,6,61,11,53,1,1,0,1,3420,"Robert Arena","None,None,None",10,1493.3333333333333,"Steve Andrews",1293.3333333333333]
["Mattie Vezquez","Viribus Unitas","Green",4,4,22,0,16,0,1,0,0,700,"Ken Arena","None,None,None",8,1194.6666666666667,"Mattie Vezquez",1194.6666666666667]
["William Tustin","Mackenson","Green",5,5,84,18,34,0,1,0,0,2220,"Kevin Plumer","None,None,None",9,1344,"William Tustin",1344]
["Kevin Sundberg","Indiana","Green",6,6.5,97,12,58,0,1,0,0,2950,"Caleb Smith","None,None,None",10,1493.3333333333333,"Kevin Sundberg",1493.3333333333333]

{"sheet":"NC June Mon 1","index":42,"n_rows":41,"n_cols":20,"rows_kept":41,"cut":false,"hidden":false,"merged":[]}
[null,null,null,null,null,null,null,null,"Winner:",{"$f":"IF(K2>K3, B2, IF(K3>K2, B3, \"Tie\"))","v":"Green"},null,"Battle Type","Battle Location and Month (i.e. MD May)","NC June",null,null,null,null,"Fleet"]
["Fleet 1 :","Green",null,"Fleet Units:",93.5,"Fleet Weight:",149,"Fleet Battle Damage:",19540,"Fleet Score:",19900,null,"Battle Day","Mon",null,null,null,null,"Mini-Fleet"]
["Fleet 2 :","Orange",null,"Fleet Units:",91,"Fleet Weight:",149.5,"Fleet Battle Damage:",21000,"Fleet Score:",19540.001953125,null,"Battle Number",1,null,null,null,null,"Individual"]
["Captian","Ship","Fleet","Class","Units","Above","On","Below","Sinks","Participate all Sorties","Penalties Points","2nd Sortie Sink","Damage Points","Scored By","Notes","Weight Factor","Weight Points","Captian","Captain Points","Indiv Points"]
["Brian Koehler","Queen Elizabeth","Green",5,5.5,79,5,24,0,1,0,0,1610,"Unknown","None,None,None",9,1268.4563758389263,"Brian Koehler",1268.4563758389263]
["Neil Humble","Queen Elizabeth","Green",5,5.5,21,4,12,0,1,0,0,650,"Cameron Hunt","None,None,None",9,1268.4563758389263,"Neil Humble",1268.4563758389263]
["Kevin Bray","Moltke","Green",4,4,15,7,6,0,1,0,0,470,"Owen Ronning","None,None,None",8,1127.5167785234898,"Kevin Bray",1127.5167785234898]
["Timothy Beckett","Bismarck","Green",6,6.5,40,10,45,0,1,200,0,1950,"Kevin Plumer","Ram- Below,None,None",10,1209.3959731543623,"Timothy Beckett",1209.3959731543623]
["Tyler Helland","Queen Elizabeth","Green",5,5.5,34,1,10,0,1,0,0,660,"Kevin Plumer","None,None,None",9,1268.4563758389263,"Tyler Helland",1268.4563758389263]
["McCoy Helland","Queen Elizabeth","Green",5,5.5,34,2,20,0,1,0,0,980,"Unknown","None,None,None",9,1268.4563758389263,"McCoy Helland",1268.4563758389263]
["Ken Kelly","Stralsund","Green",1,1.5,5,3,2,0,1,0,0,170,"Matthew Andrews","None,None,None",4,563.75838926174492,"Ken Kelly",563.75838926174492]
["Lou Meszaros","Queen Elizabeth","Green",5,5.5,36,7,57,0,0,900,0,2210,"Unknown","Withdraw,None,None",4.5,-265.77181208053685,"Lou Meszaros",-265.77181208053685]
["Richard Whitsell","Fiji ","Green",2,2.5,6,1,3,0,1,0,0,170,"Tom Palmer","None,None,None",6,845.63758389261739,"Richard Whitsell",845.63758389261739]
["Kevin Sundberg","South Dakota","Green",6,6.5,61,21,47,0,1,0,0,2440,"Matt Moury","None,None,None",10,1409.3959731543623,"Kevin Sundberg",1409.3959731543623]
["William Tustin","Mackesen","Green",5,5,42,11,29,1,0,0,0,2410,"Matthew Andrews","None,None,None",4.5,634.22818791946315,"William Tustin",634.22818791946315]
["Brian Lamb","North Carolina","Green",6,6,12,3,8,0,1,0,0,420,"Kevin Plumer","None,None,None",10,1409.3959731543623,"Brian Lamb",1409.3959731543623]
["Chris Pearce","Tiger","Green",4,4.5,20,1,7,0,1,0,0,430,"Matthew Larsen","None,None,None",8,1127.5167785234898,"Chris Pearce",1127.5167785234898]
["Bryan Box","Blucher","Green",3,3.5,23,1,3,1,1,0,1,1040,"Nathan Armstrong","None,None,None",7,986.57718120805373,"Bryan Box",786.57718120805373]
["Matthew Larsen","Seydlitz","Green",4,4.5,13,6,20,0,1,0,0,850,"Mike Smith","None,None,None",8,1127.5167785234898,"Matthew Larsen",1127.5167785234898]
["Mark Kuntz","Kaiser","Green",4,4,21,0,7,0,0,0,0,420,"Peter Ellison","None,None,None",4,563.75838926174492,"Mark Kuntz",563.75838926174492]
["Steve Andrews","North Carolina","Green",6,6,11,4,5,0,1,0,0,340,"Ginger Andrews","None,None,None",10,1409.3959731543623,"Steve Andrews",1409.3959731543623]
["Chris Grossaint","Nagato","Green",6,6,29,5,29,0,1,0,0,1260,"Chris Pearce","None,None,None",10,1409.3959731543623,"Chris Grossaint",1409.3959731543623]
["Ken Arena","Iron Duke","Green",5,5.5,29,4,23,0,1,0,0,1060,"Robert Arena","None,None,None",9,1268.4563758389263,"Ken Arena",1268.4563758389263]
["Robert Arena","Arizona","Orange",5,5.5,46,5,32,0,1,0,0,1520,"Ken Arena","None,None,None",9,1176.3210702341137,"Robert Arena",1176.3210702341137]
["Andy Terpstra","Nagato","Orange",6,6,19,5,20,0,1,0,0,890,"Unknown","None,None,None",10,1307.0234113712374,"Andy Terpstra",1307.0234113712374]
["Bob Hoernemann","Nagato","Orange",6,6,41,17,31,0,1,0,0,1680,"Kevin Sundberg","None,None,None",10,1307.0234113712374,"Bob Hoernemann",1307.0234113712374]
["Zach Hoernemann","Nagato","Orange",6,6,47,5,18,0,1,0,0,1110,"McCoy Helland","None,None,None",10,1307.0234113712374,"Zach Hoernemann",1307.0234113712374]
["Peter Eillison","Erin","Orange",4,4.5,47,8,29,1,0,0,0,2300,"Mark Kuntz","None,None,None",4,522.80936454849495,"Peter Eillison",522.80936454849495]
["Peter Eillison","Shannon","Orange",3,3.5,8,0,2,0,0,0,0,140,"Mark Kuntz","None,None,None",3.5,457.45819397993307,"Peter Eillison",457.45819397993307]
["Tom Palmer","South Dakota","Orange",6,6.5,141,22,42,0,1,0,0,3110,"Bryan Box","None,None,None",10,1307.0234113712374,"Tom Palmer",1307.0234113712374]
["Ginger Andrews","Des Moises","Orange",3,3.5,11,0,4,0,1,0,0,230,"Steven Andrews","None,None,None",7,914.91638795986614,"Ginger Andrews",914.91638795986614]
["Kevin Plumer","Vanguard","Orange",7,7,44,7,38,0,1,0,0,1720,"Tyler Helland","None,None,None",10,1307.0234113712374,"Kevin Plumer",1307.0234113712374]
["Nathan Armstrong","Iron Duke","Orange",5,5.5,20,5,5,0,1,0,0,450,"Unknown","None,None,None",9,1176.3210702341137,"Nathan Armstrong",1176.3210702341137]
["Owen Ronning","Moltke","Orange",4,4,34,6,15,0,1,0,0,910,"Mark Kuntz","None,None,None",8,1045.6187290969899,"Owen Ronning",1045.6187290969899]
["Matt Andrews","Baden","Orange",5,5.5,9,4,9,0,1,0,0,440,"Ken Kelly","None,None,None",9,1176.3210702341137,"Matt Andrews",1176.3210702341137]
["Cameron Moury","Iron Duke","Orange",5,5.5,39,2,7,0,1,0,0,640,"Tyler Helland","None,None,None",9,1176.3210702341137,"Cameron Moury",1176.3210702341137]
["Ron Hunt","Virginia","Orange",3,3.5,27,4,16,1,1,0,1,1530,"Neil Humble","None,None,None",7,914.91638795986614,"Ron Hunt",714.91638795986614]
["Cameron Hunt","KGV","Orange",6,6,81,8,26,0,1,0,0,1750,"Neil Humble","None,None,None",10,1307.0234113712374,"Cameron Hunt",1307.0234113712374]
["Matthew Moury","Nassau","Orange",4,4,11,0,1,0,1,0,0,140,"Brian Koehler","None,None,None",8,1045.6187290969899,"Matthew Moury",1045.6187290969899]
["Mati Velzquez","Viribuis Unitias","Orange",4,4,11,1,0,0,1,0,0,130,"Brian Koehler","None,None,None",8,1045.6187290969899,"Mati Velzquez",1045.6187290969899]
["Mike Smith","Seydlitz","Orange",4,4.5,33,11,32,1,1,0,1,2310,"Tyler Helland","None,None,None",8,1045.6187290969899,"Mike Smith",845.61872909698991]

{"sheet":"NC June Mon 2","index":43,"n_rows":42,"n_cols":20,"rows_kept":42,"cut":false,"hidden":false,"merged":[]}
[null,null,null,null,null,null,null,null,"Winner:",{"$f":"IF(K2>K3, B2, IF(K3>K2, B3, \"Tie\"))","v":"Green"},null,"Battle Type","Battle Location and Month (i.e. MD May)","NC June",null,null,null,null,"Fleet"]
["Fleet 1 :","Green",null,"Fleet Units:",93.5,"Fleet Weight:",153,"Fleet Battle Damage:",18890,"Fleet Score:",20890,null,"Battle Day","Mon",null,null,null,null,"Mini-Fleet"]
["Fleet 2 :","Orange",null,"Fleet Units:",93,"Fleet Weight:",147.5,"Fleet Battle Damage:",20890,"Fleet Score:",17989.998046875,null,"Battle Number",2,null,null,null,null,"Individual"]
["Captian","Ship","Fleet","Class","Units","Above","On","Below","Sinks","Participate all Sorties","Penalties Points","2nd Sortie Sink","Damage Points","Scored By","Notes","Weight Factor","Weight Points","Captian","Captain Points","Indiv Points"]
["Cameron Moury","Iron Duke","Orange",5,5.5,36,4,13,1,1,0,1,1730,"Ken Kelly","None,None,None",9,1152.6101694915255,"Cameron Moury",952.61016949152554]
["Andy Terpstra","Nagato","Orange",6,6,30,15,28,0,1,0,0,1440,"Chris Grossaint","None,None,None",10,1280.6779661016949,"Andy Terpstra",1280.6779661016949]
["Mike Smith","Seydlitz","Orange",4,4.5,44,3,3,0,1,100,0,590,"McCoy Helland","Ram - Above,None,None",8,924.54237288135596,"Mike Smith",924.54237288135596]
["Zach Hoernemann","Nagato","Orange",6,6,59,6,22,0,1,0,0,1370,"McCoy Helland","None,None,None",10,1280.6779661016949,"Zach Hoernemann",1280.6779661016949]
["Tom Palmer","South Dakota","Orange",6,6.5,152,19,49,0,1,100,0,3370,"Richard Whitsell","Ram - Above,None,None",10,1180.6779661016949,"Tom Palmer",1180.6779661016949]
["Owen Ronning","Moltke","Orange",4,4,9,1,4,0,1,0,0,230,"Kevin Bray","None,None,None",8,1024.542372881356,"Owen Ronning",1024.542372881356]
["Kevin Plumer","Vanguard","Orange",7,7,82,25,68,0,1,0,0,3360,"Bryan Box","None,None,None",10,1280.6779661016949,"Kevin Plumer",1280.6779661016949]
["Matt Andrews","Erin","Orange",4,4.5,44,4,6,0,1,0,0,700,"Steven Andrews","None,None,None",8,1024.542372881356,"Matt Andrews",1024.542372881356]
["Bob Hoernemann","Nagato","Orange",6,6,45,13,29,0,1,0,0,1580,"Matthew Larsen","None,None,None",10,1280.6779661016949,"Bob Hoernemann",1280.6779661016949]
["Matthew Moury","Nassau","Orange",4,4,13,2,11,0,1,0,0,500,"Ken Kelly","None,None,None",8,1024.542372881356,"Matthew Moury",1024.542372881356]
["Mati Velzquez","Viribuis Unitias","Orange",4,4,4,0,1,1,1,0,1,870,"Mark Kuntz","None,None,None",8,1024.542372881356,"Mati Velzquez",824.54237288135596]
["Ginger Andrews","Des Moises","Orange",3,3.5,2,1,0,0,1,0,0,40,"Kevin Sundberg","None,None,None",7,896.47457627118649,"Ginger Andrews",896.47457627118649]
["Robert Arena","Arizona","Orange",5,5.5,47,4,14,0,1,0,0,970,"Ken Arena","None,None,None",9,1152.6101694915255,"Robert Arena",1152.6101694915255]
["Nathan Armstrong","Iron Duke","Orange",5,5.5,2,1,2,1,0,0,0,1000,"Brian Koehler","None,None,None",4.5,576.30508474576277,"Nathan Armstrong",576.30508474576277]
["Nathan Armstrong","Fargo","Orange",3,3,0,0,0,0,0,0,0,0,"Brian Koehler","None,None,None",3.5,448.23728813559325,"Nathan Armstrong",448.23728813559325]
["Peter Eillison","Erin","Orange",4,4.5,14,0,7,1,0,0,0,1150,"Mark Kuntz","None,None,None",4,512.27118644067798,"Peter Eillison",512.27118644067798]
["Peter Eillison","Shannon","Orange",3,3.5,3,0,4,0,0,0,0,150,"Tyler Helland","None,None,None",3.5,448.23728813559325,"Peter Eillison",448.23728813559325]
["Cameron Hunt","KGV","Orange",6,6,27,4,28,0,1,0,0,1190,"Neil Humble","None,None,None",10,1280.6779661016949,"Cameron Hunt",1280.6779661016949]
["Ron Hunt","Virginia","Orange",3,3.5,19,5,12,0,1,700,0,650,"Neil Humble","Withdraw,None,None",7,196.47457627118649,"Ron Hunt",196.47457627118649]
["McCoy Helland","Queen Elizabeth","Green",5,5.5,142,5,25,0,1,0,0,2270,"Peter Ellison","None,None,None",9,1228.8235294117646,"McCoy Helland",1228.8235294117646]
["Brian Lamb","North Carolina","Green",6,6,11,3,2,0,1,0,0,230,"Kevin Plumer","None,None,None",10,1365.3594771241831,"Brian Lamb",1365.3594771241831]
["Chris Pearce","Tiger","Green",4,4.5,22,3,4,0,1,0,0,400,"Kevin Plumer","None,None,None",8,1092.2875816993464,"Chris Pearce",1092.2875816993464]
["Brian Koehler","Queen Elizabeth","Green",5,5.5,71,7,28,0,1,0,0,1690,"Nathan Armstrong","None,None,None",9,1228.8235294117646,"Brian Koehler",1228.8235294117646]
["Chris Grossaint","Nagato","Green",6,6,24,2,18,0,1,0,0,820,"Tom Palmer","None,None,None",10,1365.3594771241831,"Chris Grossaint",1365.3594771241831]
["Ken Arena","Iron Duke","Green",5,5.5,9,3,1,0,1,0,0,180,"Rob Arena","None,None,None",9,1228.8235294117646,"Ken Arena",1228.8235294117646]
["William Tustin","Mackesen","Green",5,5,26,4,14,1,0,0,0,1660,"Mark Kuntz","None,None,None",4.5,614.41176470588232,"William Tustin",614.41176470588232]
["Mark Kuntz","Kaiser","Green",4,4,27,4,7,1,1,0,1,1360,"Unknown","None,None,None",8,1092.2875816993464,"Mark Kuntz",892.28758169934645]
["Steve Andrews","North Carolina","Green",6,6,57,3,11,0,1,0,0,960,"Ginger Andrews","None,None,None",10,1365.3594771241831,"Steve Andrews",1365.3594771241831]
["Kevin Sundberg","South Dakota","Green",6,6.5,50,8,26,0,1,0,0,1440,"Matt Moury","None,None,None",10,1365.3594771241831,"Kevin Sundberg",1365.3594771241831]
["Kevin Bray","Moltke","Green",4,4,10,2,4,0,1,0,0,260,"Owen Ronning","None,None,None",8,1092.2875816993464,"Kevin Bray",1092.2875816993464]
["Lou Meszaros","Queen Elizabeth","Green",5,5.5,55,0,19,1,0,0,0,2020,"Unknown","None,None,None",4.5,614.41176470588232,"Lou Meszaros",614.41176470588232]
["Ken Kelly","Stralsund","Green",1,1.5,0,0,3,0,1,0,0,90,"Robert Arena","None,None,None",4,546.14379084967322,"Ken Kelly",546.14379084967322]
["Richard Whitsell","Fiji ","Green",2,2.5,2,2,3,0,1,0,0,150,"Tom Palmer","None,None,None",6,819.21568627450984,"Richard Whitsell",819.21568627450984]
["Timothy Beckett","Bismarck","Green",6,6.5,55,18,70,0,1,0,0,3010,"Andy Terpstra","None,None,None",10,1365.3594771241831,"Timothy Beckett",1365.3594771241831]
["Tyler Helland","Queen Elizabeth","Green",5,5.5,25,3,14,0,1,0,0,730,"Peter Ellison","None,None,None",9,1228.8235294117646,"Tyler Helland",1228.8235294117646]
["Matthew Larsen","Seydlitz","Green",4,4.5,7,4,7,0,1,0,0,360,"Unknown","None,None,None",8,1092.2875816993464,"Matthew Larsen",1092.2875816993464]
["Neil Humble","Queen Elizabeth","Green",5,5.5,42,11,8,0,1,0,0,880,"Cameron Hunt","None,None,None",9,1228.8235294117646,"Neil Humble",1228.8235294117646]
["Bryan Box","Blucher","Green",3,3.5,11,0,9,0,1,0,0,380,"Nathan Armstrong","None,None,None",7,955.75163398692803,"Bryan Box",955.75163398692803]

{"sheet":"NC June Tues 1","index":44,"n_rows":41,"n_cols":20,"rows_kept":41,"cut":false,"hidden":false,"merged":[]}
[null,null,null,null,null,null,null,null,"Winner:",{"$f":"IF(K2>K3, B2, IF(K3>K2, B3, \"Tie\"))","v":"Orange"},null,"Battle Type","Battle Location and Month (i.e. MD May)","NC June",null,null,null,null,"Fleet"]
["Fleet 1 :","Green",null,"Fleet Units:",91.5,"Fleet Weight:",156.5,"Fleet Battle Damage:",20770,"Fleet Score:",20129.998046875,null,"Battle Day","Tues",null,null,null,null,"Mini-Fleet"]
["Fleet 2 :","Orange",null,"Fleet Units:",87.5,"Fleet Weight:",150.5,"Fleet Battle Damage:",21330,"Fleet Score:",20170,null,"Battle Number",1,null,null,null,null,"Individual"]
["Captian","Ship","Fleet","Class","Units","Above","On","Below","Sinks","Participate all Sorties","Penalties Points","2nd Sortie Sink","Damage Points","Scored By","Notes","Weight Factor","Weight Points","Captian","Captain Points","Indiv Points"]
["McCoy Helland","Queen Elizabeth","Green",5,5.5,38,1,9,0,1,0,0,670,"Zach Hoernemann","None,None,None",9,1226.6453674121406,"McCoy Helland",1226.6453674121406]
["Richard Whitsell","Fiji ","Green",2,2.5,4,3,1,0,1,0,0,130,"Tom Palmer","None,None,None",6,817.76357827476033,"Richard Whitsell",817.76357827476033]
["Tyler Helland","Queen Elizabeth","Green",5,5.5,35,3,1,0,1,0,0,440,"Unknown","None,None,None",9,1226.6453674121406,"Tyler Helland",1226.6453674121406]
["Matthew Larsen","Glorie","Green",2,2.5,0,0,0,0,1,0,0,0,"Bob Hoernemann","None,None,None",6,817.76357827476033,"Matthew Larsen",817.76357827476033]
["Chris Pearce","Tiger","Green",4,4.5,43,3,3,0,1,0,0,580,"Kevin Plumer","None,None,None",8,1090.3514376996804,"Chris Pearce",1090.3514376996804]
["Kevin Bray","Moltke","Green",4,4,24,9,22,0,1,0,0,1080,"Owen Ronning","None,None,None",8,1090.3514376996804,"Kevin Bray",1090.3514376996804]
["Brian Lamb","North Carolina","Green",6,6,23,5,13,0,1,0,0,720,"Peter Ellison","None,None,None",10,1362.9392971246007,"Brian Lamb",1362.9392971246007]
["Chris Grossaint","Nagato","Green",6,6,41,9,17,0,1,200,0,1100,"Andy Terpstra","Ram - Below,None,None",10,1162.9392971246007,"Chris Grossaint",1162.9392971246007]
["William Tustin","Mackesen","Green",5,5,72,14,34,0,1,0,0,2020,"Robert Arena","None,None,None",9,1226.6453674121406,"William Tustin",1226.6453674121406]
["Mark Kuntz","Kaiser","Green",4,4,55,14,35,1,1,100,1,2680,"Carl Bitondo","Ram - Above,None,None",8,990.35143769968045,"Mark Kuntz",790.35143769968045]
["Kevin Sundberg","South Dakota","Green",6,6.5,54,14,18,0,1,0,0,1360,"Cameron Hunt","None,None,None",10,1362.9392971246007,"Kevin Sundberg",1362.9392971246007]
["Timothy Beckett","Bismarck","Green",6,6.5,43,19,49,0,1,0,0,2280,"Peter Ellison","None,None,None",10,1362.9392971246007,"Timothy Beckett",1362.9392971246007]
["Steve Andrews","North Carolina","Green",6,6,49,1,6,0,1,0,0,690,"Matthew Andrews","None,None,None",10,1362.9392971246007,"Steve Andrews",1362.9392971246007]
["Neil Humble","Queen Elizabeth","Green",5,5.5,6,0,24,0,1,900,0,780,"Matthew Andrews","Withdraw,None,None",9,326.64536741214056,"Neil Humble",326.64536741214056]
["Bryan Box","Blucher","Green",3,3.5,15,2,9,1,0,0,0,1160,"Nate Armstrong","None,None,None",3.5,477.02875399361022,"Bryan Box",477.02875399361022]
["Lou Meszaros","Queen Elizabeth","Green",5,5.5,37,2,24,0,1,0,0,1130,"Nate Armstrong","None,None,None",9,1226.6453674121406,"Lou Meszaros",1226.6453674121406]
["Ken Arena","Iron Duke","Green",5,5.5,35,7,16,1,1,0,1,1870,"Robert Arena","None,None,None",9,1226.6453674121406,"Ken Arena",1026.6453674121406]
["Ken Kelly","Stralsund","Green",1,1.5,5,2,4,0,1,0,0,210,"Mati Velezquez","None,None,None",4,545.17571884984022,"Ken Kelly",545.17571884984022]
["Brian Koehler","Queen Elizabeth","Green",5,5.5,75,2,6,1,1,0,1,1870,"Nate Armstrong","None,None,None",9,1226.6453674121406,"Brian Koehler",1026.6453674121406]
["Cameron Hunt","KGV","Orange",6,6,13,9,13,0,1,0,0,700,"Kevin Sundberg","None,None,None",10,1380.0664451827245,"Cameron Hunt",1380.0664451827245]
["Tom Palmer","South Dakota","Orange",6,6.5,95,3,24,0,1,200,0,1730,"Unknown","Ram - Below,None,None",10,1180.0664451827245,"Tom Palmer",1180.0664451827245]
["Zach Hoernemann","Nagato","Orange",6,6,54,1,20,0,1,0,0,1160,"Tyler Helland","None,None,None",10,1380.0664451827245,"Zach Hoernemann",1380.0664451827245]
["Bob Hoernemann","Nagato","Orange",6,6,50,10,34,0,1,0,0,1720,"Unknown","None,None,None",10,1380.0664451827245,"Bob Hoernemann",1380.0664451827245]
["Andy Terpstra","Nagato","Orange",6,6,17,16,47,0,1,0,0,1900,"Timothy Beckett","None,None,None",10,1380.0664451827245,"Andy Terpstra",1380.0664451827245]
["Mike Smith","Seydlitz","Orange",4,4.5,36,1,10,0,1,0,0,680,"McCoy Helland","None,None,None",8,1104.0531561461794,"Mike Smith",1104.0531561461794]
["Owen Ronning","Moltke","Orange",4,4,21,5,16,0,1,0,0,790,"Kevin Bray","None,None,None",8,1104.0531561461794,"Owen Ronning",1104.0531561461794]
["Peter Eillison","Erin","Orange",4,4.5,94,14,38,1,1,0,1,3160,"Brian Lamb","None,None,None",8,1104.0531561461794,"Peter Eillison",904.05315614617939]
["Mati Velzquez","Viribuis Unitias","Orange",4,4,1,0,2,0,1,0,0,70,"Brian Koehler","None,None,None",8,1104.0531561461794,"Mati Velzquez",1104.0531561461794]
["Kevin Plumer","Vanguard","Orange",7,7,57,7,35,0,1,200,0,1760,"Timothy Beckett","Ram - Below,None,None",10,1180.0664451827245,"Kevin Plumer",1180.0664451827245]
["Ron Hunt","Virginia","Orange",3,3.5,18,13,15,1,1,0,1,1590,"Neil Humble","None,None,None",7,966.04651162790697,"Ron Hunt",766.04651162790697]
["Robert Arena","Arizona","Orange",5,5.5,9,0,4,0,1,0,0,210,"Ken Arena","None,None,None",9,1242.0598006644518,"Robert Arena",1242.0598006644518]
["Matt Andrews","Erin","Orange",4,4.5,14,0,1,0,1,0,0,170,"Neil Humble","None,None,None",8,1104.0531561461794,"Matt Andrews",1104.0531561461794]
["Nathan Armstrong","Fargo","Orange",3,3,2,4,7,1,0,0,0,1010,"Lou Meszaros","None,None,None",3.5,483.02325581395348,"Nathan Armstrong",483.02325581395348]
["Cameron Moury","Iron Duke","Orange",5,5.5,14,1,2,1,1,0,1,1120,"Ken Kelly","None,None,None",9,1242.0598006644518,"Cameron Moury",1042.0598006644518]
["Matthew Moury","Nassau","Orange",4,4,24,2,8,1,1,0,1,1320,"Ken Kelly","None,None,None",8,1104.0531561461794,"Matthew Moury",904.05315614617939]
["Carl Bitondo","Deutschland","Orange",3,3.5,9,0,10,0,1,200,0,390,"Mark Kuntz","Ram - Below ,None,None",7,766.04651162790697,"Carl Bitondo",766.04651162790697]
["Eric Bitondo","Deutschland","Orange",3,3.5,25,3,28,1,1,0,1,1850,"Mark Kuntz","None,None,None",7,966.04651162790697,"Eric Bitondo",766.04651162790697]

{"sheet":"NC June Tues Campaign","index":45,"n_rows":21,"n_cols":43,"rows_kept":21,"cut":false,"hidden":false,"merged":[]}
[null,null,null,null,null,null,null,null,"Winner:",{"$f":"IF(K2>K3, B2, IF(K3>K2, B3, \"Tie\"))","v":"Orange"},null,null,"Battle Location and Month (i.e. MD May)","NC June",null,"Convoy Runs",null,null,null,null,null,null,"Sinks",null,null,null,null,null,"Convoy Friendly Ram",null,null,null,null,null,null,"Ram Penalties"]
["Fleet 1 :","Green",null,null,null,"Fleet Points:",{"$f":"B15","v":27250},"Fleet Penalties:",{"$f":"B16","v":50},"Fleet Score:",{"$f":"B17","v":27200},null,"Battle Day","Tues",null,"Captain","Fleet","Ship","Ship Length","Number of Runs","Points",null,"Captain","Fleet","Ship","Class","Sink Points",null,"Ramming Captain","Fleet","Convoy Ship","Convoy Captain","Ship Length","Points",null,"Ramming Captain","Fleet","Ram Type","Rammed Captain","Rammed Ship","Rammed Ship Class","Ram Sink","Points"]
["Fleet 2 :","Orange",null,null,null,"Fleet Points:",{"$f":"C15","v":34100},"Fleet Penalties:",{"$f":"C16","v":1000},"Fleet Score:",{"$f":"C17","v":33100},null,null,null,null,"Timothy Beckett","Green","Heian Maru",45,8,4400,null,"Chris Pearce","Green","Fiji ",2,600,null,null,null,null,null,null,null,null,"Brian Lamb","Green","Superstructure","Kevin Plumer","South Dakota",6,0,50]
[null,null,null,null,null,null,null,null,null,null,null,null,null,null,null,"Kevin Bray","Green","Hospital",45,5,2750,null,null,null,null,null,null,null,null,null,null,null,null,null,null,"Zach Hoernemann","Orange","Sink","Brian Lamb","North Carolina",6,1,1000]
["Fleet:",{"$f":"B2","v":"Green"},{"$f":"B3","v":"Orange"},null,null,null,null,null,null,null,null,null,null,null,null,"Ken Arena","Green","Hirakawa Maru",45,8,4400]
["Targets Remaining:",0,0,null,null,null,null,null,null,null,null,null,null,null,null,"McCoy Helland","Green","Hirakawa Maru 2",45,2,1100]
["Target Points:",0,0,null,null,null,null,null,null,null,null,null,null,null,null,"Steve Andrews","Green","C3",41.75,5,2750]
["Convoy Run Points:",27250,33500,null,null,null,null,null,null,null,null,null,null,null,null,"Neil Humble","Green","C3",41.75,3,1650]
["Scuttled Convoy Points:",0,0,null,null,null,null,null,null,null,null,null,null,null,null,"Bryan Box","Green","Wasp",60.75,5,4250]
["Sink Points:",null,600,null,null,null,null,null,null,null,null,null,null,null,null,"William Tustin","Green","Queen Mary",73,5,4250]
["Convoy Friendly Ram Points:",null,null,null,null,null,null,null,null,null,null,null,null,null,null,"Lou Meszaros","Green","Wasp",60.75,2,1700]
["Ram Penalty Points:",50,1000,null,null,null,null,null,null,null,null,null,null,null,null,"Matt Andrews","Orange","Admiral Taylor",51.5,2,1100]
["No Ship on Water Points:",0,0,null,null,null,null,null,null,null,null,null,null,null,null,"Matt Andrews","Orange","Hiyo",60,6,5100]
["Convoy Run Every 10 Min Points:",0,0,null,null,null,null,null,null,null,null,null,null,null,null,"Tom Palmer","Orange","Saratoga",72,10,8500]
["Total Points:",{"$f":"B7+B8+B9+B10+B11+B13+B14","v":27250},{"$f":"C7+C8+C9+C10+C11+C13+C14","v":34100},null,null,null,null,null,null,null,null,null,null,null,null,"Cameron Moury","Orange","Algol",45,4,2200]
["Total Penalties:",{"$f":"B12","v":50},{"$f":"C12","v":1000},null,null,null,null,null,null,null,null,null,null,null,null,"Nathan Armstrong","Orange","C3",41.75,8,4400]
["Fleet Score:",{"$f":"B15-B16","v":27200},{"$f":"C15-C16","v":33100},null,null,null,null,null,null,null,null,null,null,null,null,"Mati Velzquez","Orange","Bogue",41.75,4,2200]
[null,null,null,null,null,null,null,null,null,null,null,null,null,null,null,"Robert Arena","Orange","Shinano",72,4,3400]
[null,null,null,null,null,null,null,null,null,null,null,null,null,null,null,"Robert Arena","Orange","Admiral Taylor",51.5,3,1650]
[null,null,null,null,null,null,null,null,null,null,null,null,null,null,null,"Owen Ronning","Orange","Bogue 2",41.75,3,1650]
[null,null,null,null,null,null,null,null,null,null,null,null,null,null,null,"Cameron Hunt","Orange","C3",41.75,6,3300]

{"sheet":"NC June Wed 1","index":46,"n_rows":6,"n_cols":20,"rows_kept":6,"cut":false,"hidden":false,"merged":[]}
[null,null,null,null,null,null,null,null,"Winner:",{"$f":"IF(K2>K3, B2, IF(K3>K2, B3, \"Tie\"))","v":"Green"},null,"Battle Type","Battle Location and Month (i.e. MD May)","NC June",null,null,null,null,"Fleet"]
["Fleet 1 :","Orange",null,"Fleet Units:",5.5,"Fleet Weight:",9,"Fleet Battle Damage:",1540,"Fleet Score:",900,null,"Battle Day","Wed",null,null,null,null,"Mini-Fleet"]
["Fleet 2 :","Green",null,"Fleet Units:",6,"Fleet Weight:",10,"Fleet Battle Damage:",900,"Fleet Score:",1540,null,"Battle Number",1,null,null,null,null,"Individual"]
["Captian","Ship","Fleet","Class","Units","Above","On","Below","Sinks","Participate all Sorties","Penalties Points","2nd Sortie Sink","Damage Points","Scored By","Notes","Weight Factor","Weight Points","Captian","Captain Points","Indiv Points"]
["Robert Arena","Arizona","Orange",5,5.5,60,5,28,0,1,0,0,1540,"Robert Arena","None,None,None",9,900,"Robert Arena",900,0]
["Steve Andrews","North Carolina","Green",6,6,46,4,12,0,1,0,0,900,"Steven Andrews","None,None,None",10,1540,"Steve Andrews",1540,640]

{"sheet":"NC June Wed 2","index":47,"n_rows":18,"n_cols":20,"rows_kept":18,"cut":false,"hidden":false,"merged":[]}
[null,null,null,null,null,null,null,null,"Winner:",{"$f":"IF(K2>K3, B2, IF(K3>K2, B3, \"Tie\"))","v":"Orange"},null,"Battle Type","Battle Location and Month (i.e. MD May)","NC June",null,null,null,null,"Fleet"]
["Fleet 1 :","Green",null,"Fleet Units:",21.5,"Fleet Weight:",35.5,"Fleet Battle Damage:",10370,"Fleet Score:",5300,null,"Battle Day","Wed",null,null,null,null,"Mini-Fleet"]
["Fleet 2 :","Orange",null,"Fleet Units:",22,"Fleet Weight:",43.5,"Fleet Battle Damage:",6700,"Fleet Score:",10370,null,"Battle Number",2,null,null,null,null,"Individual"]
["Captian","Ship","Fleet","Class","Units","Above","On","Below","Sinks","Participate all Sorties","Penalties Points","2nd Sortie Sink","Damage Points","Scored By","Notes","Weight Factor","Weight Points","Captian","Captain Points","Indiv Points"]
["Bryan Box","Blucher","Green",3,3.5,94,9,9,1,0,0,0,2090,"Bryan Box","None,None,None",3.5,660.56338028169012,"Bryan Box",660.56338028169012,0]
["Cameron Hunt","Virginia","Green",3,3.5,54,8,11,1,0,0,0,1730,"Kevin Plumer","None,None,None",3.5,660.56338028169012,"Cameron Hunt",660.56338028169012,0]
["Eric Bitondo","Deutschland","Green",3,3.5,65,11,10,0,1,600,0,1170,"Eric Bitondo","Ram - Below,None,None",7,721.12676056338023,"Eric Bitondo",721.12676056338023,0]
["Carl Bitondo","Deutschland","Green",3,3.5,62,7,21,1,0,800,0,2090,"Carl Bitondo","Ram - Below,None,None",3.5,-139.43661971830988,"Carl Bitondo",-139.43661971830988,0]
["McCoy Helland","Filbertino","Green",2,2.5,21,15,11,2,1,0,1,2040,"McCoy Helland","None,None,None",6,1132.394366197183,"McCoy Helland",932.39436619718299,0]
["Tyler Helland","Filbertino","Green",2,2.5,24,1,2,0,1,0,0,320,"Tyler Helland","None,None,None",6,1132.394366197183,"Tyler Helland",1132.394366197183,0]
["Matthew Larsen","Glorie","Green",2,2.5,14,8,21,0,1,0,0,930,"Matthew Larsen","None,None,None",6,1132.394366197183,"Matthew Larsen",1132.394366197183,0]
["Kevin Plumer","Hipper","Orange",3,3.5,27,1,6,1,1,0,1,1170,"Kevin Plumer","None,None,None",7,1668.7356321839079,"Kevin Plumer",1468.7356321839079,815.86206896551721]
["Zach Hoernemann","Radetzky","Orange",3,3.5,59,6,8,1,1,0,1,1650,"Zach Hoernemann","None,None,None",7,1668.7356321839079,"Zach Hoernemann",1468.7356321839079,815.86206896551721]
["Neil Humble","Cleveland","Orange",3,3,24,1,7,0,0,0,0,470,"Neil Humble","None,None,None",3.5,834.36781609195396,"Neil Humble",834.36781609195396,407.93103448275861]
["Andy Terpstra","Glorie","Orange",2,2.5,1,0,1,0,1,0,0,40,"Andy Terpstra","None,None,None",6,1430.344827586207,"Andy Terpstra",1430.344827586207,699.31034482758616]
["Owen Ronning","Shannon","Orange",3,3.5,53,8,15,1,1,0,1,1840,"Owen Ronning","None,None,None",7,1668.7356321839079,"Owen Ronning",1468.7356321839079,815.86206896551721]
["Mike Smith","Glorie","Orange",2,2.5,10,1,4,0,1,0,0,240,"Mike Smith","None,None,None",6,1430.344827586207,"Mike Smith",1430.344827586207,699.31034482758616]
["Bob Hoernemann","Radetzky","Orange",3,3.5,41,8,24,0,1,0,0,1290,"Bob Hoernemann","None,None,None",7,1668.7356321839079,"Bob Hoernemann",1668.7356321839079,815.86206896551721]

{"sheet":"NC June Thurs 1","index":48,"n_rows":42,"n_cols":20,"rows_kept":42,"cut":false,"hidden":false,"merged":[]}
[null,null,null,null,null,null,null,null,"Winner:",{"$f":"IF(K2>K3, B2, IF(K3>K2, B3, \"Tie\"))","v":"Orange"},null,"Battle Type","Battle Location and Month (i.e. MD May)","NC June",null,null,null,null,"Fleet"]
["Fleet 1 :","Green",null,"Fleet Units:",94.5,"Fleet Weight:",153,"Fleet Battle Damage:",23270,"Fleet Score:",19630.001953125,null,"Battle Day","Thurs",null,null,null,null,"Mini-Fleet"]
["Fleet 2 :","Orange",null,"Fleet Units:",84,"Fleet Weight:",139.5,"Fleet Battle Damage:",19980,"Fleet Score:",22670.001953125,null,"Battle Number",1,null,null,null,null,"Individual"]
["Captian","Ship","Fleet","Class","Units","Above","On","Below","Sinks","Participate all Sorties","Penalties Points","2nd Sortie Sink","Damage Points","Scored By","Notes","Weight Factor","Weight Points","Captian","Captain Points","Indiv Points"]
["Mike Smith","Seydlitz","Orange",4,4.5,11,4,14,0,1,0,0,610,"McCoy Helland","None,None,None",8,1334.4802867383512,"Mike Smith",1334.4802867383512]
["Bob Hoernemann","Nagato","Orange",6,6,33,7,20,0,1,200,0,1070,"McCoy Helland","Ram - Below,None,None",10,1468.1003584229391,"Bob Hoernemann",1468.1003584229391]
["Zach Hoernemann","Nagato","Orange",6,6,42,1,21,1,1,200,1,2070,"Tyler Helland","Ram - Below,None,None",10,1468.1003584229391,"Zach Hoernemann",1268.1003584229391]
["Tom Palmer","South Dakota","Orange",6,6.5,139,18,60,0,1,0,0,3550,"Tyler Helland","None,None,None",10,1668.1003584229391,"Tom Palmer",1668.1003584229391]
["Andy Terpstra","Nagato","Orange",6,6,37,25,35,0,1,0,0,1920,"Chris Pearce","None,None,None",10,1668.1003584229391,"Andy Terpstra",1668.1003584229391]
["Eric Bitondo","Deutschland","Orange",3,3.5,21,10,24,0,1,0,0,1130,"Mark Kuntz","None,None,None",7,1167.6702508960575,"Eric Bitondo",1167.6702508960575]
["Peter Eillison","Erin","Orange",4,4.5,67,15,43,1,0,0,0,3060,"Brian Lamb","None,None,None",4,667.2401433691756,"Peter Eillison",667.2401433691756]
["Peter Eillison","Shannon","Orange",3,3.5,0,0,0,0,0,0,0,0,"Brian Lamb","None,None,None",3.5,583.83512544802875,"Peter Eillison",583.83512544802875]
["Ginger Andrews","Des Moises","Orange",3,3.5,1,1,2,0,1,0,0,90,"Ken Kelly","None,None,None",7,1167.6702508960575,"Ginger Andrews",1167.6702508960575]
["Ron Hunt","Von Der Tann","Orange",4,4,43,8,18,0,1,0,0,1130,"Neil Humble","None,None,None",8,1334.4802867383512,"Ron Hunt",1334.4802867383512]
["Cameron Hunt","KGV","Orange",6,6,14,0,3,0,1,0,0,230,"Lou Meszaros","None,None,None",10,1668.1003584229391,"Cameron Hunt",1668.1003584229391]
["Robert Arena","Arizona","Orange",5,5.5,24,3,12,0,1,0,0,660,"Ken Arena","None,None,None",9,1501.2903225806451,"Robert Arena",1501.2903225806451]
["Carl Bitondo","Deutschland","Orange",3,3.5,26,13,19,0,1,0,0,1090,"Bryan Box","None,None,None",7,1167.6702508960575,"Carl Bitondo",1167.6702508960575]
["Owen Ronning","Moltke","Orange",4,4,24,4,8,0,1,200,0,560,"Kevin Bray","Ram - Below,None,None",8,1134.4802867383512,"Owen Ronning",1134.4802867383512]
["Matthew Moury","Nassau","Orange",4,4,30,8,20,1,0,0,0,1860,"Ken Kelly","None,None,None",4,667.2401433691756,"Matthew Moury",667.2401433691756]
["Cameron Moury","Iron Duke","Orange",5,5.5,21,4,6,0,1,0,0,470,"Neil Humble","None,None,None",9,1501.2903225806451,"Cameron Moury",1501.2903225806451]
["Nathan Armstrong","Fargo","Orange",3,3,4,1,3,0,1,0,0,150,"Brian Koehler","None,None,None",7,1167.6702508960575,"Nathan Armstrong",1167.6702508960575]
["Matt Andrews","Erin","Orange",4,4.5,18,3,3,0,1,0,0,330,"Kevin Sundberg","None,None,None",8,1334.4802867383512,"Matt Andrews",1334.4802867383512]
["Lou Meszaros","Queen Elizabeth","Green",5,5.5,35,3,32,0,1,0,0,1370,"Cameron Hunt","None,None,None",9,1175.2941176470588,"Lou Meszaros",1175.2941176470588]
["Brian Lamb","North Carolina","Green",6,6,34,4,9,0,1,0,0,690,"Peter Ellison","None,None,None",10,1305.8823529411766,"Brian Lamb",1305.8823529411766]
["Mark Kuntz","Kaiser","Green",4,4,40,5,5,1,1,0,1,1450,"Eric Bitondo","None,None,None",8,1044.7058823529412,"Mark Kuntz",844.70588235294122]
["Ken Arena","Iron Duke","Green",5,5.5,6,2,4,1,0,0,0,1120,"Rob Arena","None,None,None",4.5,587.64705882352939,"Ken Arena",587.64705882352939]
["Chris Grossaint","Nagato","Green",6,6,24,2,11,0,1,0,0,610,"Andy Terpstra","None,None,None",10,1305.8823529411766,"Chris Grossaint",1305.8823529411766]
["Chris Pearce","Fiji ","Green",2,2.5,1,0,0,1,0,0,0,610,"Andy Terpstra","None,None,None",3,391.76470588235293,"Chris Pearce",391.76470588235293]
["William Tustin","Mackesen","Green",5,5,77,19,39,1,1,0,1,3220,"Ginger Andrews","None,None,None",9,1175.2941176470588,"William Tustin",975.29411764705878]
["Neil Humble","Queen Elizabeth","Green",5,5.5,39,5,25,0,1,0,0,1240,"Cam Moury","None,None,None",9,1175.2941176470588,"Neil Humble",1175.2941176470588]
["Kevin Bray","Moltke","Green",4,4,19,14,14,0,1,0,0,890,"Owen Ronning","None,None,None",8,1044.7058823529412,"Kevin Bray",1044.7058823529412]
["Timothy Beckett","Bismarck","Green",6,6.5,39,9,37,0,1,0,0,1680,"Mike Smith","None,None,None",10,1305.8823529411766,"Timothy Beckett",1305.8823529411766]
["Steve Andrews","North Carolina","Green",6,6,38,4,11,1,1,0,1,1790,"Ron Hunt","None,None,None",10,1305.8823529411766,"Steve Andrews",1105.8823529411766]
["Richard Whitsell","Fiji ","Green",2,2.5,2,0,0,0,0,0,0,20,"Andy Terpstra","None,None,None",3,391.76470588235293,"Richard Whitsell",391.76470588235293]
["Richard Whitsell","Graff Spee","Green",3,3,0,0,0,1,0,350,0,700,"Andy Terpstra","Unseaworthy,None,None",3.5,107.05882352941171,"Richard Whitsell",107.05882352941171]
["Brian Koehler","Queen Elizabeth","Green",5,5.5,25,0,4,1,1,0,1,1270,"Nate Armstrong","None,None,None",9,1175.2941176470588,"Brian Koehler",975.29411764705878]
["Kevin Sundberg","South Dakota","Green",6,6.5,46,12,30,1,1,0,1,2600,"Matthew Andrews","None,None,None",10,1305.8823529411766,"Kevin Sundberg",1105.8823529411766]
["Matthew Larsen","Seydlitz","Green",4,4.5,17,7,36,0,1,0,0,1390,"Andy Terpstra","None,None,None",8,1044.7058823529412,"Matthew Larsen",1044.7058823529412]
["McCoy Helland","Queen Elizabeth","Green",5,5.5,69,5,11,0,1,0,0,1120,"Zach Hoernemann","None,None,None",9,1175.2941176470588,"McCoy Helland",1175.2941176470588]
["Tyler Helland","Queen Elizabeth","Green",5,5.5,75,1,16,0,1,0,0,1250,"Zach Hoeremann","None,None,None",9,1175.2941176470588,"Tyler Helland",1175.2941176470588]
["Ken Kelly","Stralsund","Green",1,1.5,0,0,0,0,1,0,0,0,"Matthew Andrews","None,None,None",4,522.35294117647061,"Ken Kelly",522.35294117647061]
["Bryan Box","Blucher","Green",3,3.5,13,3,2,0,1,0,0,250,"Nathan Armstrong","None,None,None",7,914.11764705882342,"Bryan Box",914.11764705882342]

{"sheet":"NC June Thurs Campaign","index":49,"n_rows":20,"n_cols":43,"rows_kept":20,"cut":false,"hidden":false,"merged":[]}
[null,null,null,null,null,null,null,null,"Winner:",{"$f":"IF(K2>K3, B2, IF(K3>K2, B3, \"Tie\"))","v":"Green"},null,null,"Battle Location and Month (i.e. MD May)","NC June",null,"Convoy Runs",null,null,null,null,null,null,"Sinks",null,null,null,null,null,"Convoy Friendly Ram",null,null,null,null,null,null,"Ram Penalties"]
["Fleet 1 :","Green",null,null,null,"Fleet Points:",{"$f":"B15","v":41300},"Fleet Penalties:",{"$f":"B16","v":0},"Fleet Score:",{"$f":"B17","v":41300},null,"Battle Day","Thurs",null,"Captain","Fleet","Ship","Ship Length","Number of Runs","Points",null,"Captain","Fleet","Ship","Class","Sink Points",null,"Ramming Captain","Fleet","Convoy Ship","Convoy Captain","Ship Length","Points",null,"Ramming Captain","Fleet","Ram Type","Rammed Captain","Rammed Ship","Rammed Ship Class","Ram Sink","Points"]
["Fleet 2 :","Orange",null,null,null,"Fleet Points:",{"$f":"C15","v":24650},"Fleet Penalties:",{"$f":"C16","v":0},"Fleet Score:",{"$f":"C17","v":24650},null,null,null,null,"Matt Andrews","Orange","Admiral Taylor",45,8,4400,null,"Mati Velzquez","Orange","Viribuis Unitias",4,800]
[null,null,null,null,null,null,null,null,null,null,null,null,null,null,null,"Robert Arena","Orange","Saratoga",72,11,9350,null,"Bryan Box","Green","Blucher",3,700]
["Fleet:",{"$f":"B2","v":"Green"},{"$f":"B3","v":"Orange"},null,null,null,null,null,null,null,null,null,null,null,null,"Tom Palmer","Orange","Saratoga",72,1,850]
["Targets Remaining:",0,0,null,null,null,null,null,null,null,null,null,null,null,null,"Cameron Moury","Orange","Pusen",35.33,3,1650]
["Target Points:",0,0,null,null,null,null,null,null,null,null,null,null,null,null,"Nathan Armstrong","Orange","C3",45,6,3300]
["Convoy Run Points:",40500,23950,null,null,null,null,null,null,null,null,null,null,null,null,"Peter Eillison","Orange","Liberty",38,3,1650]
["Scuttled Convoy Points:",0,0,null,null,null,null,null,null,null,null,null,null,null,null,"Mati Velzquez","Orange","Prusen",35.33,5,2750]
["Sink Points:",800,700,null,null,null,null,null,null,null,null,null,null,null,null,"Ken Arena","Green","Heinen Maru",45,4,2200]
["Convoy Friendly Ram Points:",null,null,null,null,null,null,null,null,null,null,null,null,null,null,"William Tustin","Green","Queen Mary",73,4,3400]
["Ram Penalty Points:",null,null,null,null,null,null,null,null,null,null,null,null,null,null,"Kevin Sundberg","Green","Empress of Britain",73,2,1700]
["No Ship on Water Points:",0,0,null,null,null,null,null,null,null,null,null,null,null,null,"Bryan Box","Green","Wasp",73,3,2550]
["Convoy Run Every 10 Min Points:",0,0,null,null,null,null,null,null,null,null,null,null,null,null,"Lou Meszaros","Green","Wasp",73,9,7650]
["Total Points:",{"$f":"B7+B8+B9+B10+B11+B13+B14","v":41300},{"$f":"C7+C8+C9+C10+C11+C13+C14","v":24650},null,null,null,null,null,null,null,null,null,null,null,null,"Chris Grossaint","Green","Hirawara Maru",45,5,2750]
["Total Penalties:",{"$f":"B12","v":0},{"$f":"C12","v":0},null,null,null,null,null,null,null,null,null,null,null,null,"Ken Kelly","Green","Wolf",35.5,9,4950]
["Fleet Score:",{"$f":"B15-B16","v":41300},{"$f":"C15-C16","v":24650},null,null,null,null,null,null,null,null,null,null,null,null,"Neil Humble","Green","Liberty",35,1,550]
[null,null,null,null,null,null,null,null,null,null,null,null,null,null,null,"Timothy Beckett","Green","Wasp",73,7,5950]
[null,null,null,null,null,null,null,null,null,null,null,null,null,null,null,"Chris Pearce","Green","Hirakawa Maru 2",45,9,4950]
[null,null,null,null,null,null,null,null,null,null,null,null,null,null,null,"Kevin Bray","Green","Hospital",45,7,3850]

{"sheet":"Instructions","index":50,"n_rows":13,"n_cols":2,"rows_kept":13,"cut":false,"hidden":true,"merged":[[8,1,8,11],[10,0,10,10],[12,0,12,6],[1,0,1,12],[3,0,3,15],[5,0,5,7],[7,0,7,12]]}
[]
["Ensure that all participating captains/ships are entered into the Captian Tab."]
[]
["Make a COPY of the \"Master Score Sheet\" tab and rename it to the name of the battle to be scored."]
[]
["Enter Opposing Fleet Names into Cells B2 & B3"]
[]
["Use the \"Enter Score\" button to enter the socres for ALL battlers in the battle."]
[null,"DO NOT CLOSE THE WINDOW UNTIL ALL SCORES ARE ENTERED"]
[]
["Use the \"Calculate Totals\" button to finish the scoring of the battle"]
[]
["The Winner will be displayed in Cell J1"]