{"text_format":"1","workbook":"xlsx","n_sheets":76,"sheets":["Von","ScoreList","BattleSummary","Nats Awards","Potential Cap List","Captain","Campaign Master","Master","Nats Duke Dance ","Nats Friday 1","Nats Thurs Campaign","Nats Steve v Justin 1","Nats Matt v Justin 1","Nats Matt v Caleb 1","Nats Cruiser 2","Nats Cruiser 1","Nats Thurs 1","Nats Wed 1","Nats Tues Campaign","Nats Tues 1","Nats Mon 2","Nats Mon 1","LA Nov Sun 2","LA Nov Sun 1","LA Nov Sat 3","LA Nov Sat 2","LA Nov Sat 1","MN May Sun 2","MN May Sun 1","MN May Sat 3","MN May Sat 2","MN May Sat 1","PA Jun Sun 1","PA Jun Sat 1","PA Jun Fri 2","PA Jun Fri 1","MI May Sun 3","NC Apr Sun 1","GA May Sun 1","GA May Sat 1","GA Sep Sun 1","GA Sep Sat 1","LA Mar Sun 2","LA Mar Sun 1","LA Mar Sat 2","LA Mar Sat 1","MN Sep Sun 3","MN Sep Sun 2","MN Sep Sun 1","MI May Sun 2","MI May Sun 1","MI May Sat 2","MI May Sat 1","GA Feb Sun 1","GA Feb Sat 2","GA Feb Sat 1","NC Oct Sun 1","NC Oct Sat 3","NC Oct Sat 2","NC Oct Sat 1","NC Oct Fri 2","NC Oct Fri 1","PA Sep Sun 1","PA Sep Sat 3","PA Sep Sat 2","PA Set Sat 1","PA Sep Fri 1","MI Oct Sat 3","MI Oct Sat 2","MI Oct Sat 1","MI Sep Sat 3","MI Sep Sat 2","MI Sep Sat 1","MI Aug Sat 1","MI Jul 1 1","Instructions"],"not_rendered":{"charts":0,"images":80,"macros":1,"external_links":0,"defined_names":77,"comments":0,"pivot_tables":2},"unopened":[],"bounds":{"document_bytes":16777216,"sheet_cells":100000,"rows_first":2000,"rows_last":500,"rows_between":2000,"halvings":0,"cell_chars":16384,"cell_head_chars":4096},"cells_cut":0,"cells_raw":0,"read":"whole","date_system":"1900"}

{"sheet":"Von","index":0,"n_rows":78,"n_cols":5,"rows_kept":78,"cut":false,"hidden":false,"merged":[]}
["Row Labels","Sum of Score",null,null,"List of Battles"]
["Blue",156700,null,null,"MI Jul"]
["Red",149175,null,null,"MI Aug"]
["Kas Gaigalas",52248.756589960954,null,null,"MI Sep"]
["Steve Andrews",39557.905837151819,null,null,"MI Oct"]
["Bob Hoernemann",29269.307671319315,null,null,"PA Sep"]
["William Tustin",28585.233982227557,null,null,"PA Set"]
["Andy Terpstra",27491.082555419282,null,null,"PA Sep"]
["Tom Palmer",27237.191833318364,null,null,"NC Oct"]
["Kevin Plumer",25600.702990982791,null,null,"GA Feb"]
["Michael Smith",23422.938937169958,null,null,"MI May"]
["Nate Graham",23403.060070647523,null,null,"MN Sep"]
["Craig Singer",23025.302495649961,null,null,"LA Mar"]
["Jeff Lide",22872.198516302622,null,null,"GA Sep"]
["Caleb Smith",21854.31153411878,null,null,"GA May"]
["Matt Larson",21384.49408046871,null,null,"NC Apr"]
["Tom Tanner",20769.147442988444,null,null,"MI May"]
["Kevin Sundberg",20691.139340740941,null,null,"PA Jun"]
["Rick Whitsell",19914.584593333813,null,null,"MN May"]
["Brian Koehler",17752.511136721958,null,null,"LA Nov"]
["Tyler Helland",17276.462364271058,null,null,"Nats"]
["Gerald Roberts",15860.480633565949]
["Matt Mullis",15714.80722014548]
["Matt Andrews",15496.621726313455]
["Robert Stalnaker",15490.60604676515]
["Zach Hoernemann",15038.299836781389]
["Carl Bitondo",14987.497466293069]
["Peter Ellison",14605.25142807408]
["McCoy Helland",14086.730426490078]
["Eric Bitondo",13960.242521715805]
["Alex Hampton",13498.21335933903]
["John Zaruba",13347.92567885031]
["Mark Lide",13285.369155459455]
["Ken Arena",13156.811269826474]
["Rob Arena",13117.949096714132]
["Brandon Smith",12912.460132092705]
["Lee McKinzie",12908.925998620412]
["Justin Ragucci",12681.623906580175]
["Ginger Andrews",10984.454834473858]
["Ted Buehring",10289.284395209575]
["Cameron Hunt",9632.21686818743]
["Carl Camurati",9459.7079057123792]
["Bryan Box",8402.7202454196849]
["John Jones",8287.9535253564009]
["Rick Schultz",7841.2648480958496]
["Chris Pearce",7425.7707522844175]
["Johnny Adams",7420.9128918086217]
["Timothy Beckett",6839.0060464020644]
["Evan Fowler",6636.6871862454555]
["Will Cover",6406.4204356542341]
["Brian Lamb",5894.254665186596]
["Michael Tanzillo",5533.333333333333]
["Mark Roe",5245.551611738244]
["Hudson Maiers",4927.0549450549452]
["Brennen Schultz",4735.9371220548646]
["Mackinzyee Zaruba",4489.4335029935146]
["Lou Meszaros",4341.0949470117612]
["David Haynes",4233.8071674913772]
["Morgan Preston",4146.6666666666661]
["Jeff Lipp",4020.3691602602012]
["Sam Pearson",3877.5773740091909]
["Christopher Koehler",3819.7826086956525]
["Philip Pace",3738.6574661053501]
["Clint Jackson",3265.8497870692991]
["Julie Hayden ",2860.4601226993864]
["Amanda Seltzer",2677.856155757238]
["Jeff Zaruba",2610.910931174089]
["Ron Hunt",2079.7131946701329]
["Isaac McKinzie",1991.8842533162174]
["Clark Ward",1714.7252747252746]
["Neil Humble",1632.1950965445776]
["Samuel Durham",1601.2928348909654]
["William Brown",1447.5]
["Brandon Graham",1279.877300613497]
["Weston Dodge",871.66666666666663]
["(blank)"]
["Plato Avramides",-290]
["Grand Total",1190755]

{"sheet":"ScoreList","index":1,"n_rows":824,"n_cols":15,"rows_kept":824,"cut":false,"hidden":false,"merged":[]}
["Event ID","Battle ID","Battle Type","Captain","Class","Score","Damage","Sink","All Sorties","Individual Pts"]
["MI Jul","1 1","Individual","Mark Roe",5,360,1060,0,1,0]
["MI Jul","1 1","Individual","Kas Gaigalas",6,1060,360,0,1,700]
["MI Aug","Sat 1","Fleet","Craig Singer",4,-16.470588235294116,1800,1,1]
["MI Aug","Sat 1","Fleet","Mark Roe",5,206.47058823529412,880,0,1]
["MI Aug","Sat 1","Fleet","Kas Gaigalas",6,2680,390,0,1]
["MI Sep","Sat 1","Fleet","Mark Roe",5,164.73684210526312,2200,1,1]
["MI Sep","Sat 1","Fleet","Craig Singer",6,205.26315789473682,290,0,1]
["MI Sep","Sat 1","Fleet","Kas Gaigalas",6,2490,770,0,1]
["MI Sep","Sat 2","Fleet","Mark Roe",5,232.10526315789471,1290,0,1]
["MI Sep","Sat 2","Fleet","Craig Singer",6,-642.1052631578948,1330,0,1]
["MI Sep","Sat 2","Fleet","Kas Gaigalas",6,2620,490,0,1]
["MI Sep","Sat 3","Individual","Will Cover",6,370,2530,1,1,0]
["MI Sep","Sat 3","Individual","Kas Gaigalas",6,2530,570,0,1,1960]
["MI Oct","Sat 1","Fleet","Kas Gaigalas",6,3320,320,0,1]
["MI Oct","Sat 1","Fleet","Mark Roe",5,-48.421052631578959,1880,1,1]
["MI Oct","Sat 1","Fleet","Craig Singer",6,-31.578947368421069,1440,1,1]
["MI Oct","Sat 2","Fleet","Kas Gaigalas",6,3020,790,0,1]
["MI Oct","Sat 2","Fleet","Craig Singer",6,415.78947368421052,1240,0,1]
["MI Oct","Sat 2","Fleet","Mark Roe",5,374.21052631578948,1780,0,1]
["MI Oct","Sat 3","Fleet","Kas Gaigalas",6,3080,660,0,1]
["MI Oct","Sat 3","Fleet","Craig Singer",6,347.36842105263156,410,0,1]
["MI Oct","Sat 3","Fleet","Mark Roe",5,-87.368421052631618,2670,1,1]
["PA Sep","Fri 1","Fleet","Steve Andrews",4,767.05882352941171,600,0,1]
["PA Sep","Fri 1","Fleet","Craig Singer",6,1142.5,1780,0,1]
["PA Sep","Fri 1","Fleet","Kevin Sundberg",4,914,250,0,1]
["PA Sep","Fri 1","Fleet","Rick Schultz",4,914,770,0,1]
["PA Sep","Fri 1","Fleet","Nate Graham",1,457,0,0,1]
["PA Sep","Fri 1","Fleet","Caleb Smith",4,767.05882352941171,930,0,1]
["PA Sep","Fri 1","Fleet","William Tustin",4,567.05882352941171,800,0,1]
["PA Sep","Fri 1","Fleet","Kas Gaigalas",6,1142.5,460,0,1]
["PA Sep","Fri 1","Fleet","Will Cover",6,758.82352941176475,2240,1,1]
["PA Set","Sat 1","Fleet","Tom Tanner",4,733.33333333333326,3030,1,1]
["PA Set","Sat 1","Fleet","Ken Arena",5,875.45454545454538,90,0,1]
["PA Set","Sat 1","Fleet","Lee McKinzie",3,816.66666666666663,300,0,1]
["PA Set","Sat 1","Fleet","Nate Graham",5,1050,680,0,1]
["PA Set","Sat 1","Fleet","Caleb Smith",4,578.18181818181824,2040,1,1]
["PA Set","Sat 1","Fleet","Craig Singer",6,1166.6666666666667,1170,0,1]
["PA Set","Sat 1","Fleet","Matt Andrews",6,1166.6666666666667,580,0,1]
["PA Set","Sat 1","Fleet","William Tustin",4,778.18181818181824,180,0,1]
["PA Set","Sat 1","Fleet","Steve Andrews",4,278.18181818181824,1820,1,1]
["PA Set","Sat 1","Fleet","Rick Schultz",4,933.33333333333326,570,0,1]
["PA Set","Sat 1","Fleet","Kas Gaigalas",6,972.72727272727263,470,0,1]
["PA Set","Sat 1","Fleet","Ginger Andrews",3,680.90909090909088,160,0,1]
["PA Set","Sat 1","Fleet","Justin Ragucci",3,816.66666666666663,0,0,1]
["PA Set","Sat 1","Fleet","Kevin Plumer",4,466.66666666666663,1010,0,0]
["PA Set","Sat 1","Fleet","Rob Arena",5,875.45454545454538,440,0,1]
["PA Set","Sat 1","Fleet","Kevin Sundberg",4,778.18181818181824,870,0,1]
["PA Set","Sat 1","Fleet","Robert Stalnaker",5,1050,150,0,1]
["PA Set","Sat 1","Fleet","Will Cover",6,772.72727272727263,2330,1,1]
["PA Sep","Sat 2","Fleet","Kas Gaigalas",6,2044.2307692307693,600,0,1]
["PA Sep","Sat 2","Fleet","Caleb Smith",4,1435.3846153846155,2460,1,1]
["PA Sep","Sat 2","Fleet","Steve Andrews",4,1635.3846153846155,1240,0,1]
["PA Sep","Sat 2","Fleet","Ken Arena",5,1839.8076923076922,380,0,1]
["PA Sep","Sat 2","Fleet","Kevin Plumer",4,568.75,2600,1,1]
["PA Sep","Sat 2","Fleet","Tom Tanner",4,768.75,820,0,1]
["PA Sep","Sat 2","Fleet","Matt Andrews",6,480.46875,1670,1,0]
["PA Sep","Sat 2","Fleet","Nate Graham",5,864.84375,740,0,1]
["PA Sep","Sat 2","Fleet","Craig Singer",6,960.9375,1250,0,1]
["PA Sep","Sat 2","Fleet","Rob Arena",5,1839.8076923076922,1140,0,1]
["PA Sep","Sat 2","Fleet","Lee McKinzie",3,672.65625,260,0,1]
["PA Sep","Sat 2","Fleet","Rick Schultz",4,568.75,1430,1,1]
["PA Sep","Sat 2","Fleet","Kevin Sundberg",4,1635.3846153846155,330,0,1]
["PA Sep","Sat 2","Fleet","Robert Stalnaker",5,664.84375,1860,1,1]
["PA Sep","Sat 3","Fleet","Caleb Smith",1,0,1340,1,1]
["PA Sep","Sat 3","Fleet","Kevin Plumer",2,1404,340,0,1]
["PA Sep","Sat 3","Fleet","Lee McKinzie",1,0,1000,1,1]
["PA Sep","Sat 3","Fleet","Nate Graham",1,936,60,0,1]
["PA Sep","Sun 1","Fleet","Ken Arena",5,1308.5714285714284,1580,1,1]
["PA Sep","Sun 1","Fleet","Tom Tanner",4,1545.6000000000001,1160,0,1]
["PA Sep","Sun 1","Fleet","Kevin Sundberg",4,1140.952380952381,2050,1,1]
["PA Sep","Sun 1","Fleet","Kevin Plumer",4,1345.6000000000001,4380,1,1]
["PA Sep","Sun 1","Fleet","Steve Andrews",4,1340.952380952381,1390,0,1]
["PA Sep","Sun 1","Fleet","Matt Andrews",1,670.47619047619048,90,0,1]
["PA Sep","Sun 1","Fleet","Caleb Smith",4,1140.952380952381,2200,1,1]
["PA Sep","Sun 1","Fleet","William Tustin",3,1173.3333333333333,260,0,1]
["PA Sep","Sun 1","Fleet","Kas Gaigalas",6,1676.1904761904761,830,0,1]
["PA Sep","Sun 1","Fleet","Rob Arena",5,1508.5714285714284,1260,0,1]
["PA Sep","Sun 1","Fleet","Craig Singer",6,1732,3140,1,1]
["PA Sep","Sun 1","Fleet","Lee McKinzie",3,1352.4,360,0,1]
["PA Sep","Sun 1","Fleet","Nate Graham",5,1738.8,930,0,1]
["PA Sep","Sun 1","Fleet","Rick Schultz",4,1545.6000000000001,590,0,1]
["NC Oct","Fri 1","Fleet","Isaac McKinzie",1,113.33333333333333,150,0,1]
["NC Oct","Fri 1","Fleet","Rick Schultz",4,226.66666666666666,330,0,1]
["NC Oct","Fri 1","Fleet","Ginger Andrews",3,604.5454545454545,200,0,1]
["NC Oct","Fri 1","Fleet","Brennen Schultz",3,604.5454545454545,50,0,1]
["NC Oct","Fri 1","Fleet","Steve Andrews",4,690.90909090909088,600,0,1]
["NC Oct","Fri 1","Fleet","Jeff Lipp",5,255,1000,0,1]
["NC Oct","Fri 1","Fleet","Robert Stalnaker",5,255,420,0,1]
["NC Oct","Fri 2","Fleet","Steve Andrews",4,1108.9655172413793,570,0,1]
["NC Oct","Fri 2","Fleet","Jeff Lipp",5,253,2260,1,1]
["NC Oct","Fri 2","Fleet","Lee McKinzie",3,970.34482758620697,580,0,1]
["NC Oct","Fri 2","Fleet","Isaac McKinzie",1,1.3333333333333428,520,1,1]
["NC Oct","Fri 2","Fleet","Brennen Schultz",3,970.34482758620697,160,0,1]
["NC Oct","Fri 2","Fleet","Robert Stalnaker",5,453,910,0,1]
["NC Oct","Fri 2","Fleet","Ginger Andrews",3,970.34482758620697,200,0,1]
["NC Oct","Fri 2","Fleet","Rick Schultz",4,402.66666666666669,330,0,1]
["NC Oct","Sat 1","Fleet","Jeff Lipp",5,1578.75,780,0,1]
["NC Oct","Sat 1","Fleet","Lee McKinzie",3,511.55963302752298,1730,1,1]
["NC Oct","Sat 1","Fleet","Isaac McKinzie",1,350.83333333333331,510,1,0]
["NC Oct","Sat 1","Fleet","Eric Bitondo",3,1027.9166666666667,1310,1,1]
["NC Oct","Sat 1","Fleet","Carl Bitondo",3,1227.9166666666667,590,0,1]
["NC Oct","Sat 1","Fleet","Cameron Hunt",3,1227.9166666666667,330,0,1]
["NC Oct","Sat 1","Fleet","Sam Pearson",3,711.55963302752298,1010,0,1]
["NC Oct","Sat 1","Fleet","Steve Andrews",4,813.21100917431193,890,0,1]
["NC Oct","Sat 1","Fleet","Robert Stalnaker",5,714.86238532110099,2800,1,1]
["NC Oct","Sat 1","Fleet","Neil Humble",1,406.60550458715596,140,0,1]
["NC Oct","Sat 1","Fleet","Brennen Schultz",3,355.77981651376149,270,0,0]
["NC Oct","Sat 1","Fleet","Brian Koehler",5,714.86238532110099,1410,1,1]
["NC Oct","Sat 1","Fleet","Kevin Plumer",4,1403.3333333333333,1600,0,1]
["NC Oct","Sat 1","Fleet","Ginger Andrews",3,711.55963302752298,170,0,1]
["NC Oct","Sat 1","Fleet","Rick Schultz",4,1403.3333333333333,420,0,1]
["NC Oct","Sat 2","Fleet","Rick Schultz",4,672.28070175438597,310,0,1]
["NC Oct","Sat 2","Fleet","Kevin Plumer",4,672.28070175438597,1260,0,1]
["NC Oct","Sat 2","Fleet","Robert Stalnaker",5,1530.9473684210527,590,0,1]
["NC Oct","Sat 2","Fleet","Neil Humble",1,680.42105263157896,0,0,1]
["NC Oct","Sat 2","Fleet","Ginger Andrews",3,1190.7368421052631,250,0,1]
["NC Oct","Sat 2","Fleet","Brennen Schultz",3,-104.63157894736844,180,0,0]
["NC Oct","Sat 2","Fleet","Lee McKinzie",3,388.24561403508767,1470,1,1]
["NC Oct","Sat 2","Fleet","Isaac McKinzie",1,136.14035087719299,510,1,1]
["NC Oct","Sat 2","Fleet","Carl Bitondo",3,588.24561403508767,700,0,1]
["NC Oct","Sat 2","Fleet","Eric Bitondo",3,588.24561403508767,300,0,1]
["NC Oct","Sat 2","Fleet","Steve Andrews",4,1160.8421052631579,1950,1,1]
["NC Oct","Sat 2","Fleet","Jeff Lipp",5,556.31578947368416,3360,1,1]
["NC Oct","Sat 2","Fleet","Cameron Hunt",3,588.24561403508767,170,0,1]
["NC Oct","Sat 2","Fleet","Sam Pearson",3,990.73684210526312,1400,1,1]
["NC Oct","Sat 2","Fleet","Brian Koehler",5,1530.9473684210527,420,0,1]
["NC Oct","Sat 3","Fleet","Robert Stalnaker",5,838.31460674157302,2910,1,0]
["NC Oct","Sat 3","Fleet","Cameron Hunt",3,1027.8048780487807,810,0,1]
["NC Oct","Sat 3","Fleet","Eric Bitondo",3,827.80487804878067,2070,2,1]
["NC Oct","Sat 3","Fleet","Carl Bitondo",3,827.80487804878067,3090,2,1]
["NC Oct","Sat 3","Fleet","Kevin Plumer",4,1174.6341463414635,1700,0,1]
["NC Oct","Sat 3","Fleet","Steve Andrews",4,1490.3370786516853,940,0,1]
["NC Oct","Sat 3","Fleet","Isaac McKinzie",1,587.31707317073176,40,0,1]
["NC Oct","Sat 3","Fleet","Lee McKinzie",3,1304.0449438202247,640,0,1]
["NC Oct","Sat 3","Fleet","Sam Pearson",3,1304.0449438202247,610,0,1]
["NC Oct","Sat 3","Fleet","Brennen Schultz",3,1304.0449438202247,330,0,1]
["NC Oct","Sat 3","Fleet","Rick Schultz",4,1174.6341463414635,580,0,1]
["NC Oct","Sat 3","Fleet","Neil Humble",1,545.16853932584263,590,1,1]
["NC Oct","Sat 3","Fleet","Brian Koehler",3,1304.0449438202247,0,0,1]
["NC Oct","Sun 1","Fleet","Cameron Hunt",3,1405.1219512195123,340,0,1]
["NC Oct","Sun 1","Fleet","Eric Bitondo",3,1205.1219512195123,2470,2,1]
["NC Oct","Sun 1","Fleet","Carl Bitondo",3,1205.1219512195123,1720,1,1]
["NC Oct","Sun 1","Fleet","Brian Koehler",5,688.65168539325839,1260,1,0]
["NC Oct","Sun 1","Fleet","Sam Pearson",3,871.23595505617982,2040,1,1]
["NC Oct","Sun 1","Fleet","Isaac McKinzie",1,802.92682926829275,60,0,1]
["NC Oct","Sun 1","Fleet","Lee McKinzie",3,1071.2359550561798,1140,0,1]
["NC Oct","Sun 1","Fleet","Jeff Lipp",5,1377.3033707865168,2450,0,1]
["NC Oct","Sun 1","Fleet","Steve Andrews",4,1224.2696629213483,980,0,1]
["NC Oct","Sun 1","Fleet","Kevin Plumer",4,1605.8536585365855,1840,0,1]
["NC Oct","Sun 1","Fleet","Brennen Schultz",4,1605.8536585365855,380,0,1]
["NC Oct","Sun 1","Fleet","Robert Stalnaker",5,1377.3033707865168,360,0,1]
["GA Feb","Sat 1","Fleet","Kevin Plumer",5,2171.25,120,0,1]
["GA Feb","Sat 1","Fleet","William Brown",2,1447.5,60,0,1]
["GA Feb","Sat 1","Fleet","John Jones",1,360.83333333333331,90,0,1]
["GA Feb","Sat 1","Fleet","Tom Tanner",4,1930,510,0,1]
["GA Feb","Sat 1","Fleet","William Tustin",5,611.875,2390,1,1]
["GA Feb","Sat 1","Fleet","Caleb Smith",4,1930,960,0,1]
["GA Feb","Sat 1","Fleet","Matt Andrews",5,611.875,3370,1,1]
["GA Feb","Sat 1","Fleet","Steve Andrews",4,1930,800,0,1]
["GA Feb","Sat 1","Fleet","Brian Koehler",5,611.875,1540,1,1]
["GA Feb","Sat 1","Fleet","Samuel Durham",4,721.66666666666663,1200,0,1]
["GA Feb","Sat 1","Fleet","Alex Hampton",5,1971.25,1880,1,1]
["GA Feb","Sat 1","Fleet","Kevin Sundberg",5,611.875,2990,1,1]
["GA Feb","Sat 2","Fleet","Caleb Smith",4,1988,1020,0,1]
["GA Feb","Sat 2","Fleet","Kevin Plumer",5,2236.5,2870,0,1]
["GA Feb","Sat 2","Fleet","Tom Tanner",4,1988,850,0,1]
["GA Feb","Sat 2","Fleet","Matt Andrews",5,607.28971962616822,2040,1,0]
["GA Feb","Sat 2","Fleet","William Tustin",5,1214.5794392523364,1390,0,1]
["GA Feb","Sat 2","Fleet","Kevin Sundberg",5,1214.5794392523364,1280,0,1]
["GA Feb","Sat 2","Fleet","Steve Andrews",5,1014.5794392523364,3840,1,1]
["GA Feb","Sat 2","Fleet","Alex Hampton",5,2036.5,2380,2,1]
["GA Feb","Sat 2","Fleet","Brian Koehler",2,809.71962616822429,130,0,1]
["GA Feb","Sat 2","Fleet","Samuel Durham",4,879.62616822429891,1120,1,1]
["GA Feb","Sat 2","Fleet","John Jones",1,539.81308411214945,70,0,1]
["GA Feb","Sat 2","Fleet","William Tustin",2,1491,100,0,1]
["GA Feb","Sat 2","Fleet","Carl Bitondo",1,539.81308411214945,70,0,1]
["GA Feb","Sun 1","Fleet","Kevin Sundberg",5,1546.7441860465117,2590,0,1]
["GA Feb","Sun 1","Fleet","Kevin Plumer",4,1355.2238805970148,1470,0,0]
["GA Feb","Sun 1","Fleet","Carl Bitondo",1,487.44186046511629,830,1,1]
["GA Feb","Sun 1","Fleet","Tom Tanner",4,1374.8837209302326,1670,0,1]
["GA Feb","Sun 1","Fleet","Brian Koehler",5,773.37209302325584,2490,1,0]
["GA Feb","Sun 1","Fleet","Kevin Plumer",5,1524.6268656716418,740,0,0]
["GA Feb","Sun 1","Fleet","William Tustin",5,1346.7441860465117,2350,1,1]
["GA Feb","Sun 1","Fleet","Caleb Smith",4,2710.4477611940297,1330,0,1]
["GA Feb","Sun 1","Fleet","Alex Hampton",5,2849.2537313432836,3310,2,1]
["GA Feb","Sun 1","Fleet","Steve Andrews",4,2710.4477611940297,540,0,1]
["GA Feb","Sun 1","Fleet","Matt Andrews",5,773.37209302325584,1380,1,0]
["GA Feb","Sun 1","Fleet","John Jones",1,687.44186046511629,40,0,1]
["MI May","Sat 1","Fleet","Steve Andrews",5,1975.1351351351352,430,0,1]
["MI May","Sat 1","Fleet","Will Cover",6,1994.5945945945946,2220,1,1]
["MI May","Sat 1","Fleet","Kas Gaigalas",6,2194.5945945945946,500,0,1]
["MI May","Sat 1","Fleet","Mark Roe",4,1555.6756756756758,2500,1,1]
["MI May","Sat 1","Fleet","Craig Singer",6,1527.0270270270271,2000,0,1]
["MI May","Sat 1","Fleet","William Tustin",5,1374.3243243243244,1510,0,1]
["MI May","Sat 1","Fleet","Kevin Sundberg",5,1174.3243243243244,1340,1,1]
["MI May","Sat 1","Fleet","Bryan Box",5,1174.3243243243244,3270,2,1]
["MI May","Sat 2","Fleet","Kevin Sundberg",5,1120.7142857142856,470,0,1]
["MI May","Sat 2","Fleet","Evan Fowler",4,796.19047619047615,1690,2,1]
["MI May","Sat 2","Fleet","Weston Dodge",3,871.66666666666663,360,0,1]
["MI May","Sat 2","Fleet","Bryan Box",5,546.80851063829789,2130,1,1]
["MI May","Sat 2","Fleet","Will Cover",6,829.78723404255322,1020,0,1]
["MI May","Sat 2","Fleet","Steve Andrews",5,1120.7142857142856,880,0,1]
["MI May","Sat 2","Fleet","Craig Singer",6,829.78723404255322,550,0,1]
["MI May","Sat 2","Fleet","Kas Gaigalas",6,829.78723404255322,460,0,1]
["MI May","Sat 2","Fleet","Mark Roe",4,663.82978723404256,1070,0,1]
["MI May","Sat 2","Fleet","William Tustin",5,1120.7142857142856,500,0,1]
["MI May","Sun 1","Fleet","Will Cover",6,580.48780487804879,1470,1,0]
["MI May","Sun 1","Fleet","Kas Gaigalas",6,1160.9756097560976,770,0,1]
["MI May","Sun 1","Fleet","Mark Roe",4,728.78048780487813,2770,1,1]
["MI May","Sun 1","Fleet","Bryan Box",5,844.87804878048792,3680,2,1]
["MI May","Sun 1","Fleet","Kevin Sundberg",5,2106.6666666666665,1140,1,1]
["MI May","Sun 1","Fleet","Steve Andrews",5,2306.6666666666665,840,0,1]
["MI May","Sun 1","Fleet","William Tustin",5,2306.6666666666665,1110,0,1]
["MI May","Sun 1","Fleet","Craig Singer",6,2562.962962962963,310,0,1]
["MI May","Sun 1","Fleet","Nate Graham",5,844.87804878048792,1690,1,1]
["MI May","Sun 1","Fleet","Evan Fowler",3,897.03703703703695,1360,1,0]
["MI May","Sun 2","Fleet","Bryan Box",5,790,3890,3,1]
["MI May","Sun 2","Fleet","Nate Graham",5,990,910,0,1]
["MI May","Sun 2","Fleet","Kevin Sundberg",5,1565.5813953488373,610,0,1]
["MI May","Sun 2","Fleet","William Tustin",5,1565.5813953488373,1640,0,1]
["MI May","Sun 2","Fleet","Steve Andrews",4,1191.6279069767443,1850,1,1]
["MI May","Sun 2","Fleet","Craig Singer",6,1739.5348837209301,720,0,1]
["MI May","Sun 2","Fleet","Kas Gaigalas",6,1100,630,0,1]
["MI May","Sun 2","Fleet","Mark Roe",3,770,170,0,1]
["MI May","Sun 2","Fleet","Will Cover",6,1100,1880,0,1]
["MI May","Sun 2","Fleet","Evan Fowler",3,1217.6744186046512,130,0,1]
["MN Sep","Sun 1","Fleet","Hudson Maiers",5,1287,560,0,1]
["MN Sep","Sun 1","Fleet","Clint Jackson",4,1399.0243902439024,270,0,1]
["MN Sep","Sun 1","Fleet","Peter Ellison",4,1144,720,0,1]
["MN Sep","Sun 1","Fleet","Rick Whitsell",2,858,80,0,1]
["MN Sep","Sun 1","Fleet","Bryan Box",5,1087,2750,2,1]
["MN Sep","Sun 1","Fleet","Bob Hoernemann",6,1430,2100,0,1]
["MN Sep","Sun 1","Fleet","Zach Hoernemann",4,1399.0243902439024,1330,0,1]
["MN Sep","Sun 1","Fleet","Michael Smith",6,1548.780487804878,3140,1,1]
["MN Sep","Sun 1","Fleet","Tom Palmer",4,1144,960,0,1]
["MN Sep","Sun 1","Fleet","McCoy Helland",3,1224.1463414634147,310,0,1]
["MN Sep","Sun 1","Fleet","Tyler Helland",4,1199.0243902439024,2100,1,1]
["MN Sep","Sun 2","Fleet","Andy Terpstra",5,1345.1785714285716,2150,0,1]
["MN Sep","Sun 2","Fleet","Tom Palmer",4,1607.0329670329672,1040,0,1]
["MN Sep","Sun 2","Fleet","Zach Hoernemann",4,1195.7142857142856,960,0,1]
["MN Sep","Sun 2","Fleet","Bob Hoernemann",6,2008.7912087912086,2470,0,1]
["MN Sep","Sun 2","Fleet","Michael Smith",6,1494.6428571428571,1660,0,1]
["MN Sep","Sun 2","Fleet","Hudson Maiers",5,1807.9120879120878,1300,0,1]
["MN Sep","Sun 2","Fleet","Clint Jackson",4,1195.7142857142856,1070,0,1]
["MN Sep","Sun 2","Fleet","Peter Ellison",4,1607.0329670329672,1230,0,1]
["MN Sep","Sun 2","Fleet","Matt Larson",6,1294.6428571428571,1340,1,1]
["MN Sep","Sun 2","Fleet","Rick Whitsell",2,1205.2747252747254,70,0,1]
["MN Sep","Sun 2","Fleet","Tyler Helland",4,597.85714285714278,1590,1,0]
["MN Sep","Sun 2","Fleet","McCoy Helland",3,1046.25,370,0,1]
["MN Sep","Sun 2","Fleet","Bryan Box",5,903.95604395604391,2260,1,0]
["MN Sep","Sun 3","Fleet","Clint Jackson",4,671.11111111111109,1150,0,1]
["MN Sep","Sun 3","Fleet","Hudson Maiers",5,1832.1428571428573,810,0,1]
["MN Sep","Sun 3","Fleet","Andy Terpstra",5,755,1360,0,1]
["MN Sep","Sun 3","Fleet","Tom Palmer",4,1628.5714285714284,1040,0,1]
["MN Sep","Sun 3","Fleet","McCoy Helland",3,587.22222222222229,320,0,1]
["MN Sep","Sun 3","Fleet","Zach Hoernemann",4,-464.44444444444446,990,0,0]
["MN Sep","Sun 3","Fleet","Rick Whitsell",2,1221.4285714285713,0,0,1]
["MN Sep","Sun 3","Fleet","Bob Hoernemann",6,17.85714285714289,1170,0,0]
["MN Sep","Sun 3","Fleet","Peter Ellison",4,471.11111111111109,1880,1,1]
["LA Mar","Sat 1","Fleet","Andy Terpstra",6,1733.3333333333333,950,0,1]
["LA Mar","Sat 1","Fleet","Bob Hoernemann",6,1733.3333333333333,2020,0,1]
["LA Mar","Sat 1","Fleet","Gerald Roberts",4,841.84615384615392,960,0,1]
["LA Mar","Sat 1","Fleet","Brandon Smith",6,1052.3076923076924,1440,0,1]
["LA Mar","Sat 1","Fleet","Jeff Lide",7,1052.3076923076924,550,0,1]
["LA Mar","Sat 1","Fleet","Johnny Adams",1,420.92307692307696,150,0,1]
["LA Mar","Sat 1","Fleet","Johnny Adams",6,852.30769230769238,3600,1,1]
["LA Mar","Sat 1","Fleet","Matt Mullis",3,1213.3333333333333,90,0,1]
["LA Mar","Sat 1","Fleet","Mark Lide",6,1733.3333333333333,870,0,1]
["LA Mar","Sat 1","Fleet","Michael Smith",4,1186.6666666666665,1080,1,1]
["LA Mar","Sat 1","Fleet","Michael Tanzillo",6,1733.3333333333333,460,0,1]
["LA Mar","Sat 1","Fleet","Morgan Preston",4,1186.6666666666665,1370,1,1]
["LA Mar","Sat 1","Fleet","Rick Whitsell",2,631.38461538461547,190,0,1]
["LA Mar","Sat 1","Fleet","Ted Buehring",4,641.84615384615392,1330,1,1]
["LA Mar","Sat 1","Fleet","Tom Palmer",5,747.07692307692309,2700,1,1]
["LA Mar","Sat 2","Fleet","Andy Terpstra",6,1330.1587301587301,2630,1,1]
["LA Mar","Sat 2","Fleet","Bob Hoernemann",6,1330.1587301587301,3280,1,1]
["LA Mar","Sat 2","Fleet","Gerald Roberts",4,1921.2307692307693,1180,0,1]
["LA Mar","Sat 2","Fleet","Brandon Smith",6,2401.5384615384619,560,0,1]
["LA Mar","Sat 2","Fleet","Jeff Lide",7,2401.5384615384619,1700,0,1]
["LA Mar","Sat 2","Fleet","John Jones",1,960.61538461538464,90,0,1]
["LA Mar","Sat 2","Fleet","Johnny Adams",6,2401.5384615384619,2110,0,1]
["LA Mar","Sat 2","Fleet","Michael Smith",4,1224.1269841269841,870,0,1]
["LA Mar","Sat 2","Fleet","Matt Mullis",3,1071.1111111111111,70,0,1]
["LA Mar","Sat 2","Fleet","Mark Lide",6,1330.1587301587301,2080,1,1]
["LA Mar","Sat 2","Fleet","Michael Tanzillo",6,1330.1587301587301,4510,2,1]
["LA Mar","Sat 2","Fleet","Morgan Preston",4,1024.1269841269841,2170,1,1]
["LA Mar","Sat 2","Fleet","Rick Whitsell",2,1440.9230769230769,230,0,1]
["LA Mar","Sat 2","Fleet","Ted Buehring",4,1921.2307692307693,170,0,1]
["LA Mar","Sat 2","Fleet","Tom Palmer",5,1961.3846153846157,3600,1,1]
["LA Mar","Sun 1","Fleet","Andy Terpstra",6,1730.1587301587301,1320,0,1]
["LA Mar","Sun 1","Fleet","Bob Hoernemann",6,1530.1587301587301,3160,1,1]
["LA Mar","Sun 1","Fleet","Gerald Roberts",4,1510.8771929824561,1920,1,1]
["LA Mar","Sun 1","Fleet","Brandon Smith",6,2138.5964912280701,660,0,1]
["LA Mar","Sun 1","Fleet","Jeff Lide",7,1938.5964912280701,5460,1,1]
["LA Mar","Sun 1","Fleet","John Jones",1,855.43859649122805,0,0,1]
["LA Mar","Sun 1","Fleet","Johnny Adams",6,2138.5964912280701,880,0,1]
["LA Mar","Sun 1","Fleet","Matt Mullis",3,1211.1111111111111,30,0,1]
["LA Mar","Sun 1","Fleet","Mark Lide",6,1530.1587301587301,3500,2,1]
["LA Mar","Sun 1","Fleet","Michael Smith",4,1384.1269841269841,1010,0,1]
["LA Mar","Sun 1","Fleet","Michael Tanzillo",6,1730.1587301587301,500,0,1]
["LA Mar","Sun 1","Fleet","Morgan Preston",4,1184.1269841269841,2670,1,1]
["LA Mar","Sun 1","Fleet","Rick Whitsell",2,1283.1578947368421,320,0,1]
["LA Mar","Sun 1","Fleet","Tom Palmer",5,1924.7368421052631,1660,0,1]
["LA Mar","Sun 2","Fleet","Andy Terpstra",6,939.68253968253964,1040,0,1]
["LA Mar","Sun 2","Fleet","Bob Hoernemann",6,739.68253968253964,3350,1,1]
["LA Mar","Sun 2","Fleet","Gerald Roberts",4,1286.0377358490566,210,0,1]
["LA Mar","Sun 2","Fleet","Brandon Smith",6,1607.5471698113208,970,0,1]
["LA Mar","Sun 2","Fleet","Jeff Lide",7,1607.5471698113208,2250,0,1]
["LA Mar","Sun 2","Fleet","Johnny Adams",6,1607.5471698113208,920,0,1]
["LA Mar","Sun 2","Fleet","Matt Mullis",3,657.77777777777771,170,0,1]
["LA Mar","Sun 2","Fleet","Mark Lide",6,939.68253968253964,1300,0,1]
["LA Mar","Sun 2","Fleet","Michael Smith",4,751.74603174603169,440,0,1]
["LA Mar","Sun 2","Fleet","Michael Tanzillo",6,739.68253968253964,1670,1,1]
["LA Mar","Sun 2","Fleet","Morgan Preston",4,751.74603174603169,550,0,1]
["LA Mar","Sun 2","Fleet","Rick Whitsell",2,964.52830188679252,110,0,1]
["LA Mar","Sun 2","Fleet","Tom Palmer",5,1446.7924528301885,1460,0,1]
["GA Sep","Sat 1","Fleet","Ted Buehring",4,277.5,380,0,1]
["GA Sep","Sat 1","Fleet","Matt Mullis",3,242.8125,200,0,1]
["GA Sep","Sat 1","Fleet","John Zaruba",4,277.5,1100,0,1]
["GA Sep","Sat 1","Fleet","Brian Koehler",5,1967.1428571428571,330,0,1]
["GA Sep","Sat 1","Fleet","John Jones",1,874.28571428571422,0,0,1]
["GA Sep","Sat 1","Fleet","Clark Ward",4,1748.5714285714284,780,0,1]
["GA Sep","Sat 1","Fleet","Alex Hampton",5,112.1875,2910,1,1]
["GA Sep","Sun 1","Fleet","Brian Koehler",5,1425,1830,1,1]
["GA Sep","Sun 1","Fleet","Christopher Koehler",5,1425,3180,1,1]
["GA Sep","Sun 1","Fleet","Alex Hampton",5,1409.0625,560,0,1]
["GA Sep","Sun 1","Fleet","John Zaruba",4,1052.5,2580,2,1]
["GA Sep","Sun 1","Fleet","Matt Mullis",3,1095.9375,0,0,1]
["GA Sep","Sun 1","Fleet","Ted Buehring",4,1252.5,110,0,1]
["GA May","Sat 1","Fleet","Brian Koehler",5,186.92307692307691,350,0,1]
["GA May","Sat 1","Fleet","Clark Ward",4,-33.84615384615384,1360,1,1]
["GA May","Sat 1","Fleet","Alex Hampton",5,-13.076923076923094,2980,2,1]
["GA May","Sat 1","Fleet","Carl Bitondo",3,1427.3913043478262,320,0,1]
["GA May","Sat 1","Fleet","Eric Bitondo",3,1427.3913043478262,180,0,1]
["GA May","Sat 1","Fleet","Christopher Koehler",5,1835.217391304348,40,0,1]
["GA May","Sun 1","Fleet","Brian Koehler",5,765,380,0,1]
["GA May","Sun 1","Fleet","Alex Hampton",5,765,1050,0,1]
["GA May","Sun 1","Fleet","Eric Bitondo",3,435.21739130434787,150,0,1]
["GA May","Sun 1","Fleet","Carl Bitondo",3,435.21739130434787,80,0,1]
["GA May","Sun 1","Fleet","Christopher Koehler",5,559.56521739130437,1300,0,1]
["NC Apr","Sun 1","Fleet","Robert Stalnaker",5,1269.3023255813955,3200,2,1]
["NC Apr","Sun 1","Fleet","Carl Bitondo",3,1631.875,720,0,1]
["NC Apr","Sun 1","Fleet","Eric Bitondo",3,1631.875,870,0,1]
["NC Apr","Sun 1","Fleet","Brian Koehler",5,1269.3023255813955,2210,1,1]
["NC Apr","Sun 1","Fleet","Kevin Plumer",5,2098.125,1450,0,1]
["NC Apr","Sun 1","Fleet","William Tustin",5,1269.3023255813955,2720,1,1]
["NC Apr","Sun 1","Fleet","Justin Ragucci",5,2098.125,920,0,1]
["NC Apr","Sun 1","Fleet","Steve Andrews",5,1469.3023255813955,2780,0,1]
["NC Apr","Sun 1","Fleet","Julie Hayden ",4,1865,170,0,1]
["NC Apr","Sun 1","Fleet","Ginger Andrews",3,1142.7906976744187,280,0,1]
["NC Apr","Sun 1","Fleet","Tom Tanner",4,1665,2890,1,1]
["MI May","Sun 3","Fleet","Mark Roe",5,325.531914893617,1190,1,0]
["MI May","Sun 3","Fleet","Kevin Sundberg",5,651.063829787234,900,0,1]
["MI May","Sun 3","Fleet","William Tustin",5,836.66666666666663,200,0,1]
["MI May","Sun 3","Fleet","Bryan Box",5,636.66666666666663,1420,1,1]
["MI May","Sun 3","Fleet","Kas Gaigalas",6,723.40425531914889,420,0,1]
["MI May","Sun 3","Fleet","Nate Graham",5,836.66666666666663,80,0,1]
["PA Jun","Fri 1","Fleet","Kas Gaigalas",6,1379.5454545454545,400,0,1]
["PA Jun","Fri 1","Fleet","Ginger Andrews",3,965.68181818181813,80,0,1]
["PA Jun","Fri 1","Fleet","Evan Fowler",4,479.99999999999994,200,0,1]
["PA Jun","Fri 1","Fleet","Caleb Smith",4,279.99999999999994,2180,1,1]
["PA Jun","Fri 1","Fleet","Craig Singer",6,600,670,0,1]
["PA Jun","Fri 1","Fleet","Nate Graham",5,1241.5909090909092,820,0,1]
["PA Jun","Fri 1","Fleet","Plato Avramides",4,-560,370,0,0]
["PA Jun","Fri 1","Fleet","Plato Avramides",5,270,1000,0,0]
["PA Jun","Fri 1","Fleet","Steve Andrews",5,1041.5909090909092,1540,1,1]
["PA Jun","Fri 1","Fleet","Amanda Seltzer",3,420,20,0,1]
["PA Jun","Fri 1","Fleet","William Tustin",5,1191.5909090909092,250,0,1]
["PA Jun","Fri 1","Fleet","Matt Andrews",6,600,1630,0,1]
["PA Jun","Fri 2","Fleet","Ginger Andrews",3,1087.52,90,0,1]
["PA Jun","Fri 2","Fleet","Amanda Seltzer",3,1087.52,110,0,1]
["PA Jun","Fri 2","Fleet","Craig Singer",6,1022.2222222222222,2640,1,1]
["PA Jun","Fri 2","Fleet","Rob Arena",5,900,3170,1,1]
["PA Jun","Fri 2","Fleet","Evan Fowler",4,977.77777777777783,870,0,1]
["PA Jun","Fri 2","Fleet","Steve Andrews",5,1198.2399999999998,1590,1,1]
["PA Jun","Fri 2","Fleet","Matt Andrews",6,222.22222222222217,1260,0,1]
["PA Jun","Fri 2","Fleet","Carl Camurati",4,1042.8800000000001,1740,1,1]
["PA Jun","Fri 2","Fleet","Caleb Smith",4,977.77777777777783,1690,0,1]
["PA Jun","Fri 2","Fleet","Ken Arena",5,699.11999999999989,40,0,0]
["PA Jun","Fri 2","Fleet","Kas Gaigalas",6,1553.6000000000001,950,0,1]
["PA Jun","Fri 2","Fleet","Nate Graham",5,1398.2399999999998,220,0,1]
["PA Jun","Fri 2","Fleet","William Tustin",4,1242.8800000000001,1310,0,1]
["PA Jun","Fri 2","Fleet","Robert Stalnaker",5,-350,80,0,0]
["PA Jun","Sat 1","Fleet","Brandon Graham",5,1279.877300613497,520,0,1]
["PA Jun","Sat 1","Fleet","Robert Stalnaker",5,1310.2,1190,1,1]
["PA Jun","Sat 1","Fleet","Kas Gaigalas",6,1422.0858895705521,580,0,1]
["PA Jun","Sat 1","Fleet","Rob Arena",5,1279.877300613497,1020,0,1]
["PA Jun","Sat 1","Fleet","Carl Camurati",4,1342.4,570,0,1]
["PA Jun","Sat 1","Fleet","Tom Tanner",4,671.2,2400,1,0]
["PA Jun","Sat 1","Fleet","Matt Andrews",5,-344.9,860,0,0]
["PA Jun","Sat 1","Fleet","Caleb Smith",4,942.40000000000009,3580,2,1]
["PA Jun","Sat 1","Fleet","Ken Arena",5,1079.877300613497,1750,1,1]
["PA Jun","Sat 1","Fleet","Tom Tanner",3,587.30000000000007,280,0,0]
["PA Jun","Sat 1","Fleet","Evan Fowler",4,1342.4,410,0,1]
["PA Jun","Sat 1","Fleet","William Tustin",5,1279.877300613497,1820,0,1]
["PA Jun","Sat 1","Fleet","Nate Graham",5,1279.877300613497,580,0,1]
["PA Jun","Sat 1","Fleet","Steve Andrews",5,1279.877300613497,450,0,1]
["PA Jun","Sat 1","Fleet","Ginger Andrews",3,497.7300613496933,470,0,0]
["PA Jun","Sat 1","Fleet","Julie Hayden ",3,995.4601226993866,230,0,1]
["PA Jun","Sat 1","Fleet","Amanda Seltzer",3,795.4601226993866,970,1,1]
["PA Jun","Sat 1","Fleet","Craig Singer",6,839,2300,0,0]
["PA Jun","Sun 1","Fleet","Tom Tanner",3,404.95327102803736,470,0,0]
["PA Jun","Sun 1","Fleet","Tom Tanner",4,725.60747663551399,1970,2,1]
["PA Jun","Sun 1","Fleet","Steve Andrews",4,656.85950413223145,1490,1,1]
["PA Jun","Sun 1","Fleet","Caleb Smith",3,609.90654205607473,1400,1,1]
["PA Jun","Sun 1","Fleet","Craig Singer",6,1157.0093457943924,470,0,1]
["PA Jun","Sun 1","Fleet","Carl Camurati",4,925.60747663551399,460,0,1]
["PA Jun","Sun 1","Fleet","Rob Arena",5,963.96694214876038,1300,0,1]
["PA Jun","Sun 1","Fleet","Ken Arena",5,963.96694214876038,880,0,1]
["PA Jun","Sun 1","Fleet","Kas Gaigalas",6,271.07438016528931,1600,0,1]
["PA Jun","Sun 1","Fleet","Matt Andrews",5,641.30841121495314,910,0,1]
["PA Jun","Sun 1","Fleet","Nate Graham",3,749.75206611570252,40,0,1]
["PA Jun","Sun 1","Fleet","William Tustin",3,749.75206611570252,20,0,1]
["PA Jun","Sun 1","Fleet","Amanda Seltzer",3,374.87603305785126,730,1,0]
["PA Jun","Sun 1","Fleet","Ginger Andrews",3,749.75206611570252,130,0,1]
["PA Jun","Sun 1","Fleet","Evan Fowler",4,925.60747663551399,800,0,1]
["MN May","Sat 1","Fleet","Kas Gaigalas",6,1675.5555555555554,1650,1,1]
["MN May","Sat 1","Fleet","Zach Hoernemann",6,1875.5555555555554,1950,0,1]
["MN May","Sat 1","Fleet","McCoy Helland",3,1112.8888888888889,1150,1,1]
["MN May","Sat 1","Fleet","Michael Smith",4,1500.4444444444446,780,0,1]
["MN May","Sat 1","Fleet","Tyler Helland",7,1875.5555555555554,4340,0,1]
["MN May","Sat 1","Fleet","Andy Terpstra",6,1418.0327868852457,4120,2,1]
["MN May","Sat 1","Fleet","Peter Ellison",4,1094.4262295081967,1150,1,1]
["MN May","Sat 1","Fleet","Bob Hoernemann",6,1618.0327868852457,1260,0,1]
["MN May","Sat 1","Fleet","Nate Graham",5,1456.2295081967213,490,0,1]
["MN May","Sat 1","Fleet","Bryan Box",5,1456.2295081967213,290,0,1]
["MN May","Sat 1","Fleet","Tom Palmer",5,1456.2295081967213,1030,0,1]
["MN May","Sat 1","Fleet","Rick Whitsell",2,970.81967213114751,100,0,1]
["MN May","Sat 2","Fleet","McCoy Helland",3,536.22641509433959,320,0,1]
["MN May","Sat 2","Fleet","Michael Smith",4,612.83018867924523,1110,0,1]
["MN May","Sat 2","Fleet","Zach Hoernemann",6,566.03773584905662,2140,1,1]
["MN May","Sat 2","Fleet","Kas Gaigalas",6,766.03773584905662,510,0,1]
["MN May","Sat 2","Fleet","Tyler Helland",7,766.03773584905662,260,0,1]
["MN May","Sat 2","Fleet","Peter Ellison",4,412.83018867924523,2400,1,1]
["MN May","Sat 2","Fleet","Bryan Box",5,962.85714285714278,690,0,1]
["MN May","Sat 2","Fleet","Andy Terpstra",6,1069.8412698412699,730,0,1]
["MN May","Sat 2","Fleet","Tom Palmer",5,962.85714285714278,610,0,1]
["MN May","Sat 2","Fleet","Bob Hoernemann",6,1069.8412698412699,1630,0,1]
["MN May","Sat 2","Fleet","Nate Graham",5,962.85714285714278,270,0,1]
["MN May","Sat 2","Fleet","Matt Larson",6,1069.8412698412699,110,0,1]
["MN May","Sat 2","Fleet","Rick Whitsell",2,641.90476190476181,20,0,1]
["MN May","Sat 3","Fleet","McCoy Helland",3,507.79661016949154,150,0,1]
["MN May","Sat 3","Fleet","Kas Gaigalas",6,725.42372881355925,1200,0,1]
["MN May","Sat 3","Fleet","Tyler Helland",3,507.79661016949154,670,0,1]
["MN May","Sat 3","Fleet","Michael Smith",4,580.33898305084745,860,0,1]
["MN May","Sat 3","Fleet","Zach Hoernemann",6,525.42372881355925,2890,1,1]
["MN May","Sat 3","Fleet","Peter Ellison",4,580.33898305084745,1790,0,1]
["MN May","Sat 3","Fleet","Nate Graham",5,2000,420,0,1]
["MN May","Sat 3","Fleet","Tom Palmer",5,452.88135593220341,2440,1,1]
["MN May","Sat 3","Fleet","Rick Whitsell",2,1333.3333333333333,50,0,1]
["MN May","Sat 3","Fleet","Matt Larson",6,2222.2222222222222,80,0,1]
["MN May","Sat 3","Fleet","Andy Terpstra",6,2022.2222222222222,2470,1,1]
["MN May","Sat 3","Fleet","Bob Hoernemann",6,2222.2222222222222,1260,0,1]
["MN May","Sun 1","Fleet","Kas Gaigalas",6,1844.1860465116279,410,0,1]
["MN May","Sun 1","Fleet","Peter Ellison",4,1475.3488372093022,1320,0,1]
["MN May","Sun 1","Fleet","Michael Smith",4,1475.3488372093022,830,0,1]
["MN May","Sun 1","Fleet","McCoy Helland",3,1090.9302325581396,910,1,1]
["MN May","Sun 1","Fleet","Tyler Helland",6,1844.1860465116279,1030,0,1]
["MN May","Sun 1","Fleet","Bob Hoernemann",6,822.72727272727275,3770,2,1]
["MN May","Sun 1","Fleet","Zach Hoernemann",6,1022.7272727272727,800,0,1]
["MN May","Sun 1","Fleet","Tom Palmer",5,920.4545454545455,2220,0,1]
["MN May","Sun 1","Fleet","Rick Whitsell",2,613.63636363636363,30,0,1]
["MN May","Sun 1","Fleet","Nate Graham",5,920.4545454545455,1110,0,1]
["MN May","Sun 2","Fleet","Andy Terpstra",6,1378,1840,0,1]
["MN May","Sun 2","Fleet","Michael Smith",4,1102.4000000000001,730,0,1]
["MN May","Sun 2","Fleet","Kas Gaigalas",6,1378,640,0,1]
["MN May","Sun 2","Fleet","Peter Ellison",4,1102.4000000000001,880,0,1]
["MN May","Sun 2","Fleet","McCoy Helland",3,964.60000000000014,30,0,1]
["MN May","Sun 2","Fleet","Tyler Helland",3,964.60000000000014,210,0,1]
["MN May","Sun 2","Fleet","Bob Hoernemann",6,784.09090909090901,1820,1,1]
["MN May","Sun 2","Fleet","Tom Palmer",5,885.68181818181824,1900,0,1]
["MN May","Sun 2","Fleet","Matt Larson",6,784.09090909090901,2350,2,1]
["MN May","Sun 2","Fleet","Rick Whitsell",2,590.45454545454538,40,0,1]
["MN May","Sun 2","Fleet","Nate Graham",5,885.68181818181824,780,0,1]
["LA Nov","Sat 1","Fleet","John Zaruba",4,1427.3684210526314,2530,0,1]
["LA Nov","Sat 1","Fleet","Michael Smith",4,1168.3333333333333,1250,0,1]
["LA Nov","Sat 1","Fleet","Gerald Roberts",4,1168.3333333333333,1260,0,1]
["LA Nov","Sat 1","Fleet","Ted Buehring",4,968.33333333333326,1640,1,1]
["LA Nov","Sat 1","Fleet","Tom Palmer",5,1605.7894736842104,790,0,1]
["LA Nov","Sat 1","Fleet","Jeff Lide",7,-15.789473684210634,910,0,1]
["LA Nov","Sat 1","Fleet","Matt Larson",6,1784.2105263157894,1770,0,1]
["LA Nov","Sat 1","Fleet","David Haynes",4,1227.3684210526314,830,1,1]
["LA Nov","Sat 1","Fleet","Jeff Zaruba",2,1070.5263157894735,80,0,1]
["LA Nov","Sat 1","Fleet","Bob Hoernemann",6,1260.4166666666667,3390,1,1]
["LA Nov","Sat 1","Fleet","Brandon Smith",4,968.33333333333326,2530,1,1]
["LA Nov","Sat 1","Fleet","Rick Whitsell",2,876.25,100,0,1]
["LA Nov","Sat 1","Fleet","Mackinzyee Zaruba",2,1070.5263157894735,100,0,1]
["LA Nov","Sat 2","Fleet","John Zaruba",4,963.92156862745105,2690,2,1]
["LA Nov","Sat 2","Fleet","Mackinzyee Zaruba",2,872.94117647058818,680,0,1]
["LA Nov","Sat 2","Fleet","Rick Whitsell",2,1423.6363636363637,30,0,1]
["LA Nov","Sat 2","Fleet","Andy Terpstra",5,1935.4545454545455,3820,1,1]
["LA Nov","Sat 2","Fleet","Bob Hoernemann",6,2372.727272727273,1440,0,1]
["LA Nov","Sat 2","Fleet","Brandon Smith",4,1698.1818181818182,2130,2,1]
["LA Nov","Sat 2","Fleet","Matt Larson",6,1454.9019607843138,770,0,1]
["LA Nov","Sat 2","Fleet","Tom Palmer",5,1309.4117647058824,1350,0,1]
["LA Nov","Sat 2","Fleet","Michael Smith",4,1163.9215686274511,1330,0,1]
["LA Nov","Sat 2","Fleet","Jeff Lide",7,1454.9019607843138,1010,0,1]
["LA Nov","Sat 3","Fleet","Andy Terpstra",5,1070.5263157894735,1400,0,1]
["LA Nov","Sat 3","Fleet","Jeff Lide",7,2009.3023255813953,680,0,1]
["LA Nov","Sat 3","Fleet","Matt Larson",6,2009.3023255813953,1220,0,1]
["LA Nov","Sat 3","Fleet","Brandon Smith",6,1189.4736842105262,1390,0,1]
["LA Nov","Sat 3","Fleet","Tom Palmer",5,1808.372093023256,1360,0,1]
["LA Nov","Sat 3","Fleet","Michael Smith",4,951.57894736842104,640,0,1]
["LA Nov","Sat 3","Fleet","Matt Mullis",3,832.63157894736833,20,0,1]
["LA Nov","Sat 3","Fleet","Andy Terpstra",5,870.52631578947353,3190,1,1]
["LA Nov","Sat 3","Fleet","Rick Whitsell",2,713.68421052631572,250,0,1]
["LA Nov","Sat 3","Fleet","Bob Hoernemann",4,751.57894736842104,1750,1,1]
["LA Nov","Sat 3","Fleet","Mackinzyee Zaruba",2,1005.5813953488373,820,1,1]
["LA Nov","Sat 3","Fleet","John Zaruba",4,1407.4418604651162,2700,1,1]
["LA Nov","Sun 1","Fleet","Jeff Zaruba",2,1540.3846153846155,70,0,1]
["LA Nov","Sun 1","Fleet","Mackinzyee Zaruba",2,1540.3846153846155,130,0,1]
["LA Nov","Sun 1","Fleet","Ted Buehring",3,1797.1153846153845,150,0,1]
["LA Nov","Sun 1","Fleet","Matt Mullis",3,1797.1153846153845,20,0,1]
["LA Nov","Sun 1","Fleet","Gerald Roberts",4,2053.8461538461538,790,0,1]
["LA Nov","Sun 1","Fleet","Jeff Lide",7,2567.3076923076924,1250,0,1]
["LA Nov","Sun 1","Fleet","David Haynes",4,2053.8461538461538,340,0,1]
["LA Nov","Sun 1","Fleet","Tom Palmer",5,212.5,2990,1,1]
["LA Nov","Sun 1","Fleet","Andy Terpstra",5,412.5,1490,0,1]
["LA Nov","Sun 1","Fleet","Brandon Smith",6,258.33333333333331,2420,1,1]
["LA Nov","Sun 1","Fleet","Michael Smith",4,366.66666666666669,1240,0,1]
["LA Nov","Sun 1","Fleet","Matt Larson",6,258.33333333333331,2580,1,1]
["LA Nov","Sun 1","Fleet","Bob Hoernemann",4,166.66666666666669,1990,1,1]
["LA Nov","Sun 1","Fleet","Rick Whitsell",2,275,640,0,1]
["LA Nov","Sun 2","Fleet","Bob Hoernemann",4,752.5925925925925,2810,1,1]
["LA Nov","Sun 2","Fleet","Michael Smith",4,952.5925925925925,770,0,1]
["LA Nov","Sun 2","Fleet","John Zaruba",4,952.5925925925925,630,0,1]
["LA Nov","Sun 2","Fleet","Rick Whitsell",2,714.44444444444446,120,0,1]
["LA Nov","Sun 2","Fleet","Andy Terpstra",5,871.66666666666652,2530,1,1]
["LA Nov","Sun 2","Fleet","Gerald Roberts",4,1358.5185185185185,1090,0,1]
["LA Nov","Sun 2","Fleet","David Haynes",4,952.5925925925925,740,0,1]
["LA Nov","Sun 2","Fleet","Ted Buehring",3,633.51851851851848,1570,1,1]
["LA Nov","Sun 2","Fleet","Matt Mullis",3,1188.7037037037037,30,0,1]
["LA Nov","Sun 2","Fleet","Brandon Smith",6,1598.148148148148,950,0,1]
["LA Nov","Sun 2","Fleet","Matt Larson",6,1698.148148148148,1080,0,1]
["LA Nov","Sun 2","Fleet","Tom Palmer",5,1328.3333333333333,1300,0,1]
["LA Nov","Sun 2","Fleet","Jeff Lide",7,1698.148148148148,1980,0,1]
["Nats","Mon 1","Fleet","Matt Larson",6,1432.6315789473683,1260,1,1]
["Nats","Mon 1","Fleet","Kas Gaigalas",6,1412.6373626373627,900,0,1]
["Nats","Mon 1","Fleet","Steve Andrews",5,1271.3736263736264,680,0,1]
["Nats","Mon 1","Fleet","Robert Stalnaker",5,1469.3684210526317,130,0,1]
["Nats","Mon 1","Fleet","Caleb Smith",4,930.1098901098901,3110,1,1]
["Nats","Mon 1","Fleet","Jeff Lide",7,1959.1578947368421,3300,0,1]
["Nats","Mon 1","Fleet","Tom Palmer",5,1071.3736263736264,2730,1,1]
["Nats","Mon 1","Fleet","Andy Terpstra",6,1632.6315789473683,2280,0,1]
["Nats","Mon 1","Fleet","Rick Whitsell",2,847.58241758241763,210,0,1]
["Nats","Mon 1","Fleet","Ken Arena",5,1271.3736263736264,740,0,1]
["Nats","Mon 1","Fleet","William Tustin",5,1271.3736263736264,1690,0,1]
["Nats","Mon 1","Fleet","Michael Smith",4,1306.1052631578948,270,0,1]
["Nats","Mon 1","Fleet","Peter Ellison",4,1306.1052631578948,430,0,1]
["Nats","Mon 1","Fleet","Lee McKinzie",5,1271.3736263736264,380,0,1]
["Nats","Mon 1","Fleet","Gerald Roberts",6,1432.6315789473683,4310,1,1]
["Nats","Mon 1","Fleet","Tom Tanner",3,1142.8421052631577,110,0,1]
["Nats","Mon 1","Fleet","Chris Pearce",6,1412.6373626373627,2240,0,1]
["Nats","Mon 1","Fleet","Brian Lamb",6,1412.6373626373627,350,0,1]
["Nats","Mon 1","Fleet","Carl Camurati",7,1495.1648351648353,3140,1,1]
["Nats","Mon 1","Fleet","Brian Koehler",5,1269.3684210526317,1200,1,1]
["Nats","Mon 1","Fleet","McCoy Helland",3,1142.8421052631577,190,0,1]
["Nats","Mon 1","Fleet","Nate Graham",5,1071.3736263736264,2870,1,1]
["Nats","Mon 1","Fleet","Tyler Helland",7,1959.1578947368421,1790,0,1]
["Nats","Mon 1","Fleet","John Jones",1,653.0526315789474,50,0,1]
["Nats","Mon 1","Fleet","Alex Hampton",4,653.0526315789474,1120,1,0]
["Nats","Mon 1","Fleet","Ginger Andrews",3,988.84615384615392,210,0,1]
["Nats","Mon 1","Fleet","Kevin Sundberg",5,1271.3736263736264,630,0,1]
["Nats","Mon 1","Fleet","Eric Bitondo",3,1142.8421052631577,300,0,1]
["Nats","Mon 1","Fleet","Carl Bitondo",3,942.84210526315769,1590,1,1]
["Nats","Mon 1","Fleet","Matt Andrews",6,1412.6373626373627,2100,0,1]
["Nats","Mon 1","Fleet","Kevin Plumer",5,1071.3736263736264,1890,1,1]
["Nats","Mon 1","Fleet","Matt Mullis",3,1142.8421052631577,30,0,1]
["Nats","Mon 1","Fleet","Philip Pace",1,653.0526315789474,90,0,1]
["Nats","Mon 1","Fleet","Zach Hoernemann",6,1632.6315789473683,720,0,1]
["Nats","Mon 1","Fleet","Cameron Hunt",4,1130.1098901098901,750,0,1]
["Nats","Mon 1","Fleet","John Zaruba",4,1106.1052631578948,4230,1,1]
["Nats","Mon 1","Fleet","Justin Ragucci",5,1469.3684210526317,280,0,1]
["Nats","Mon 1","Fleet","Rob Arena",5,1271.3736263736264,1310,0,1]
["Nats","Mon 1","Fleet","Ted Buehring",4,1306.1052631578948,80,0,1]
["Nats","Mon 1","Fleet","Craig Singer",6,1412.6373626373627,2700,0,1]
["Nats","Mon 1","Fleet","Mark Lide",6,1632.6315789473683,1270,0,1]
["Nats","Mon 1","Fleet","Bob Hoernemann",6,1632.6315789473683,680,0,1]
["Nats","Mon 1","Fleet","Timothy Beckett",6,1412.6373626373627,2390,0,1]
["Nats","Mon 2","Fleet","Carl Bitondo",3,979.21568627450984,390,0,1]
["Nats","Mon 2","Fleet","Eric Bitondo",3,979.21568627450984,520,0,1]
["Nats","Mon 2","Fleet","William Tustin",5,1153.2614555256064,610,0,1]
["Nats","Mon 2","Fleet","Brian Koehler",5,629.49579831932772,1290,1,0]
["Nats","Mon 2","Fleet","Steve Andrews",5,1153.2614555256064,940,0,1]
["Nats","Mon 2","Fleet","Carl Camurati",7,1537.6819407008088,2470,0,1]
["Nats","Mon 2","Fleet","Matt Andrews",6,1281.401617250674,890,0,1]
["Nats","Mon 2","Fleet","Gerald Roberts",4,1119.1036414565826,1490,0,1]
["Nats","Mon 2","Fleet","Chris Pearce",6,1281.401617250674,1200,0,1]
["Nats","Mon 2","Fleet","Rob Arena",5,1153.2614555256064,1330,0,1]
["Nats","Mon 2","Fleet","Nate Graham",5,953.26145552560638,1670,1,1]
["Nats","Mon 2","Fleet","Ginger Andrews",3,696.98113207547169,1360,1,1]
["Nats","Mon 2","Fleet","Justin Ragucci",5,1258.9915966386554,110,0,1]
["Nats","Mon 2","Fleet","Caleb Smith",4,1025.1212938005392,1370,0,1]
["Nats","Mon 2","Fleet","Cameron Hunt",4,1025.1212938005392,390,0,1]
["Nats","Mon 2","Fleet","Tyler Helland",7,1678.6554621848738,2610,0,1]
["Nats","Mon 2","Fleet","Craig Singer",6,1281.401617250674,1010,0,1]
["Nats","Mon 2","Fleet","Kas Gaigalas",6,1281.401617250674,1420,0,1]
["Nats","Mon 2","Fleet","Ken Arena",5,1153.2614555256064,550,0,1]
["Nats","Mon 2","Fleet","Kevin Sundberg",5,576.63072776280319,650,0,0]
["Nats","Mon 2","Fleet","Robert Stalnaker",5,1058.9915966386554,1940,1,1]
["Nats","Mon 2","Fleet","Tom Tanner",4,1119.1036414565826,370,0,1]
["Nats","Mon 2","Fleet","Alex Hampton",4,559.55182072829132,870,1,0]
["Nats","Mon 2","Fleet","John Zaruba",4,1119.1036414565826,2260,0,1]
["Nats","Mon 2","Fleet","Ted Buehring",3,489.60784313725492,20,0,0]
["Nats","Mon 2","Fleet","Ted Buehring",4,-240.44817927170868,560,0,0]
["Nats","Mon 2","Fleet","Timothy Beckett",6,1281.401617250674,2860,0,1]
["Nats","Mon 2","Fleet","Lee McKinzie",5,1153.2614555256064,2070,0,1]
["Nats","Mon 2","Fleet","Jeff Lide",7,1678.6554621848738,1940,0,1]
["Nats","Mon 2","Fleet","Lou Meszaros",4,1025.1212938005392,1190,0,1]
["Nats","Mon 2","Fleet","Kevin Plumer",5,1153.2614555256064,1000,0,1]
["Nats","Mon 2","Fleet","Andy Terpstra",6,1398.8795518207282,1200,0,1]
["Nats","Mon 2","Fleet","Bob Hoernemann",6,699.43977591036412,1820,1,0]
["Nats","Mon 2","Fleet","Bob Hoernemann",3,489.60784313725492,190,0,0]
["Nats","Mon 2","Fleet","Zach Hoernemann",6,1398.8795518207282,1430,0,1]
["Nats","Mon 2","Fleet","Brian Lamb",6,1281.401617250674,300,0,1]
["Nats","Mon 2","Fleet","Michael Smith",4,1119.1036414565826,370,0,1]
["Nats","Mon 2","Fleet","McCoy Helland",3,979.21568627450984,0,0,1]
["Nats","Mon 2","Fleet","Matt Mullis",3,979.21568627450984,930,0,1]
["Nats","Mon 2","Fleet","Mark Lide",6,1398.8795518207282,840,0,1]
["Nats","Mon 2","Fleet","Peter Ellison",4,559.55182072829132,1810,1,0]
["Nats","Mon 2","Fleet","Tom Palmer",5,1153.2614555256064,1590,0,1]
["Nats","Mon 2","Fleet","Matt Larson",6,1398.8795518207282,780,0,1]
["Nats","Mon 2","Fleet","John Jones",1,559.55182072829132,0,0,1]
["Nats","Mon 2","Fleet","Philip Pace",1,559.55182072829132,30,0,1]
["Nats","Mon 2","Fleet","Rick Whitsell",2,768.8409703504044,100,0,1]
["Nats","Tues 1","Fleet","Lee McKinzie",5,696.21621621621625,2250,1,1]
["Nats","Tues 1","Fleet","Jeff Lide",7,1472.2222222222222,2810,0,1]
["Nats","Tues 1","Fleet","Kevin Plumer",4,596.63663663663658,3190,1,1]
["Nats","Tues 1","Fleet","Matt Andrews",5,896.21621621621625,1300,0,1]
["Nats","Tues 1","Fleet","Tom Tanner",4,1177.7777777777778,480,0,1]
["Nats","Tues 1","Fleet","Gerald Roberts",6,1472.2222222222222,2100,0,1]
["Nats","Tues 1","Fleet","Robert Stalnaker",5,1325,300,0,1]
["Nats","Tues 1","Fleet","Nate Graham",5,896.21621621621625,880,0,1]
["Nats","Tues 1","Fleet","William Tustin",5,696.21621621621625,2610,1,1]
["Nats","Tues 1","Fleet","Steve Andrews",5,896.21621621621625,1620,0,1]
["Nats","Tues 1","Fleet","Chris Pearce",6,995.79579579579581,1760,0,1]
["Nats","Tues 1","Fleet","Brian Lamb",6,995.79579579579581,100,0,1]
["Nats","Tues 1","Fleet","Craig Singer",6,995.79579579579581,1200,0,1]
["Nats","Tues 1","Fleet","Andy Terpstra",6,1472.2222222222222,880,0,1]
["Nats","Tues 1","Fleet","Carl Bitondo",3,1030.5555555555557,350,0,1]
["Nats","Tues 1","Fleet","Ken Arena",5,896.21621621621625,440,0,1]
["Nats","Tues 1","Fleet","Carl Camurati",4,796.63663663663658,1950,0,1]
["Nats","Tues 1","Fleet","Ginger Andrews",3,697.05705705705714,860,0,1]
["Nats","Tues 1","Fleet","Kas Gaigalas",6,995.79579579579581,640,0,1]
["Nats","Tues 1","Fleet","Tyler Helland",7,1472.2222222222222,1810,0,1]
["Nats","Tues 1","Fleet","McCoy Helland",3,1030.5555555555557,10,0,1]
["Nats","Tues 1","Fleet","Timothy Beckett",6,995.79579579579581,820,0,1]
["Nats","Tues 1","Fleet","Tom Palmer",5,448.10810810810813,1840,1,0]
["Nats","Tues 1","Fleet","Justin Ragucci",5,1325,770,0,1]
["Nats","Tues 1","Fleet","Lou Meszaros",4,796.63663663663658,300,0,1]
["Nats","Tues 1","Fleet","Eric Bitondo",3,1030.5555555555557,590,0,1]
["Nats","Tues 1","Fleet","Alex Hampton",4,1177.7777777777778,1200,0,1]
["Nats","Tues 1","Fleet","Kevin Sundberg",5,696.21621621621625,1860,1,1]
["Nats","Tues 1","Fleet","Zach Hoernemann",6,1472.2222222222222,720,0,1]
["Nats","Tues 1","Fleet","Matt Mullis",3,1030.5555555555557,70,0,1]
["Nats","Tues 1","Fleet","John Zaruba",4,1177.7777777777778,650,0,1]
["Nats","Tues 1","Fleet","Bob Hoernemann",6,1272.2222222222222,1060,0,1]
["Nats","Tues 1","Fleet","Rob Arena",5,896.21621621621625,770,0,1]
["Nats","Tues 1","Fleet","Caleb Smith",1,199.15915915915915,150,0,0]
["Nats","Tues 1","Fleet","Caleb Smith",4,398.31831831831829,1950,1,0]
["Nats","Tues 1","Fleet","Mark Lide",6,1472.2222222222222,580,0,1]
["Nats","Tues 1","Fleet","Michael Smith",4,1177.7777777777778,1030,0,1]
["Nats","Tues 1","Fleet","Matt Larson",6,1472.2222222222222,620,0,1]
["Nats","Tues 1","Fleet","Brian Koehler",2,883.33333333333337,20,0,1]
["Nats","Tues 1","Fleet","Rick Whitsell",2,298.73873873873873,10,0,0]
["Nats","Tues 1","Fleet","Peter Ellison",4,1177.7777777777778,430,0,1]
["Nats","Tues 1","Fleet","John Jones",1,588.88888888888891,100,0,1]
["Nats","Tues 1","Fleet","Philip Pace",1,588.88888888888891,0,0,1]
["Nats","Tues Campaign","Fleet","Red",8,73375,0,0,0]
["Nats","Tues Campaign","Fleet","Blue",8,88550,0,0,0]
["Nats","Wed 1","Fleet","Steve Andrews",5,528.08823529411768,60,0,1]
["Nats","Wed 1","Fleet","Caleb Smith",4,469.41176470588232,160,0,1]
["Nats","Wed 1","Fleet","Kevin Plumer",5,528.08823529411768,130,0,1]
["Nats","Wed 1","Fleet","Rick Whitsell",2,352.05882352941177,10,0,1]
["Nats","Wed 1","Fleet","Tom Palmer",5,528.08823529411768,150,0,1]
["Nats","Wed 1","Fleet","Chris Pearce",6,586.76470588235293,780,0,1]
["Nats","Wed 1","Fleet","Matt Mullis",3,514.3478260869565,90,0,1]
["Nats","Wed 1","Fleet","John Zaruba",4,587.82608695652175,1040,0,1]
["Nats","Wed 1","Fleet","Tom Tanner",4,387.82608695652175,2860,1,1]
["Nats","Wed 1","Fleet","Ron Hunt",3,410.73529411764702,240,0,1]
["Nats","Wed 1","Fleet","Kas Gaigalas",6,586.76470588235293,160,0,1]
["Nats","Thurs 1","Fleet","Robert Stalnaker",5,1326.25,1410,1,1]
["Nats","Thurs 1","Fleet","Ron Hunt",3,1133.5359116022098,1050,0,1]
["Nats","Thurs 1","Fleet","Carl Camurati",4,1295.4696132596684,960,0,1]
["Nats","Thurs 1","Fleet","Nate Graham",5,1457.4033149171271,940,0,1]
["Nats","Thurs 1","Fleet","Chris Pearce",6,1619.3370165745855,1210,0,1]
["Nats","Thurs 1","Fleet","Lee McKinzie",5,1257.4033149171271,3170,1,1]
["Nats","Thurs 1","Fleet","Justin Ragucci",5,1526.25,680,0,1]
["Nats","Thurs 1","Fleet","Rob Arena",1,323.86740331491711,160,0,0]
["Nats","Thurs 1","Fleet","Lou Meszaros",4,1295.4696132596684,350,0,1]
["Nats","Thurs 1","Fleet","Carl Bitondo",3,1187.0833333333333,490,0,1]
["Nats","Thurs 1","Fleet","Eric Bitondo",3,1187.0833333333333,900,0,1]
["Nats","Thurs 1","Fleet","Steve Andrews",5,1457.4033149171271,1450,0,1]
["Nats","Thurs 1","Fleet","Tom Tanner",4,1356.6666666666665,220,0,1]
["Nats","Thurs 1","Fleet","Gerald Roberts",6,1695.8333333333333,3150,0,1]
["Nats","Thurs 1","Fleet","Kas Gaigalas",6,1619.3370165745855,690,0,1]
["Nats","Thurs 1","Fleet","Rob Arena",5,728.70165745856355,1600,1,0]
["Nats","Thurs 1","Fleet","Kevin Plumer",5,1457.4033149171271,1130,0,1]
["Nats","Thurs 1","Fleet","Brian Lamb",3,1133.5359116022098,80,0,1]
["Nats","Thurs 1","Fleet","William Tustin",5,1457.4033149171271,1230,0,1]
["Nats","Thurs 1","Fleet","Matt Andrews",5,1457.4033149171271,1040,0,1]
["Nats","Thurs 1","Fleet","Caleb Smith",4,1095.4696132596684,2270,1,1]
["Nats","Thurs 1","Fleet","John Zaruba",4,1295.4696132596684,2520,0,1]
["Nats","Thurs 1","Fleet","Jeff Lide",7,1695.8333333333333,3580,0,1]
["Nats","Thurs 1","Fleet","Tyler Helland",7,1495.8333333333333,6130,1,1]
["Nats","Thurs 1","Fleet","Alex Hampton",4,1356.6666666666665,1030,0,1]
["Nats","Thurs 1","Fleet","Craig Singer",6,1419.3370165745855,3900,1,1]
["Nats","Thurs 1","Fleet","Mark Lide",6,1695.8333333333333,1660,0,1]
["Nats","Thurs 1","Fleet","Matt Larson",6,1695.8333333333333,740,0,1]
["Nats","Thurs 1","Fleet","Bob Hoernemann",6,1645.8333333333333,2230,0,1]
["Nats","Thurs 1","Fleet","Philip Pace",1,678.33333333333326,80,0,1]
["Nats","Thurs 1","Fleet","Rick Whitsell",2,971.60220994475139,210,0,1]
["Nats","Thurs 1","Fleet","John Jones",1,678.33333333333326,60,0,1]
["Nats","Thurs 1","Fleet","Zach Hoernemann",6,1595.8333333333333,1110,0,1]
["Nats","Thurs 1","Fleet","Ken Arena",5,1257.4033149171271,1610,1,1]
["Nats","Thurs 1","Fleet","Brian Koehler",5,1526.25,1710,0,1]
["Nats","Thurs 1","Fleet","Timothy Beckett",6,1619.3370165745855,1450,0,1]
["Nats","Thurs 1","Fleet","Matt Mullis",3,1133.5359116022098,20,0,1]
["Nats","Thurs 1","Fleet","Peter Ellison",4,1156.6666666666665,1990,1,1]
["Nats","Thurs 1","Fleet","Michael Smith",4,456.66666666666652,410,0,1]
["Nats","Thurs 1","Fleet","Tom Palmer",5,1457.4033149171271,510,0,1]
["Nats","Thurs 1","Fleet","Andy Terpstra",6,1695.8333333333333,1650,0,1]
["Nats","Thurs 1","Fleet","Cameron Hunt",3,566.7679558011049,940,1,0]
["Nats","Thurs 1","Fleet","McCoy Helland",3,1187.0833333333333,80,0,1]
["Nats","Cruiser 1","Mini-Fleet","Peter Ellison",4,333.33333333333337,2250,1,1,0,null,null,null,"Row Labels","Sum of 0"]
["Nats","Cruiser 1","Mini-Fleet","Kevin Plumer",3,948.76923076923083,670,0,1,582.61538461538464,null,null,null,"Matt Andrews",0]
["Nats","Cruiser 1","Mini-Fleet","Matt Mullis",3,-466.66666666666669,80,0,0,0,null,null,null,"Steve Andrews",484.11754653033086]
["Nats","Cruiser 1","Mini-Fleet","Philip Pace",1,66.666666666666686,570,1,1,0,null,null,null,"Ken Arena",0]
["Nats","Cruiser 1","Mini-Fleet","John Jones",1,542.15384615384619,190,0,1,332.92307692307696,null,null,null,"Rob Arena"]
["Nats","Cruiser 1","Mini-Fleet","Tyler Helland",2,813.23076923076928,150,0,1,499.38461538461542,null,null,null,"Timothy Beckett"]
["Nats","Cruiser 1","Mini-Fleet","McCoy Helland",3,948.76923076923083,100,0,1,582.61538461538464,null,null,null,"Carl Camurati"]
["Nats","Cruiser 1","Mini-Fleet","Steve Andrews",3,466.66666666666663,690,0,1,0,null,null,null,"Peter Ellison",484.7057674632353]
["Nats","Cruiser 1","Mini-Fleet","Lee McKinzie",3,266.66666666666663,1620,1,1,0,null,null,null,"Kas Gaigalas",499.38461538461542]
["Nats","Cruiser 1","Mini-Fleet","Caleb Smith",1,542.15384615384619,420,0,1,332.92307692307696,null,null,null,"Nate Graham"]
["Nats","Cruiser 1","Mini-Fleet","Tom Tanner",3,948.76923076923083,110,0,1,582.61538461538464,null,null,null,"McCoy Helland",582.61538461538464]
["Nats","Cruiser 1","Mini-Fleet","Bob Hoernemann",3,466.66666666666663,430,0,1,0,null,null,null,"Tyler Helland",499.38461538461542]
["Nats","Cruiser 1","Mini-Fleet","Craig Singer",2,400,130,0,1,0,null,null,null,"Bob Hoernemann",424.11754653033086]
["Nats","Cruiser 1","Mini-Fleet","Andy Terpstra",2,200,1300,2,1,0,null,null,null,"Zach Hoernemann",424.11754653033086]
["Nats","Cruiser 1","Mini-Fleet","Kas Gaigalas",2,813.23076923076928,90,0,1,499.38461538461542,null,null,null,"John Jones",332.92307692307696]
["Nats","Cruiser 1","Mini-Fleet","Eric Bitondo",3,948.76923076923083,510,0,1,582.61538461538464,null,null,null,"Brian Koehler"]
["Nats","Cruiser 1","Mini-Fleet","Carl Bitondo",3,948.76923076923083,560,0,1,582.61538461538464,null,null,null,"Brian Lamb"]
["Nats","Cruiser 1","Mini-Fleet","John Zaruba",2,406.61538461538464,880,1,0,249.69230769230771,null,null,null,"Jeff Lide"]
["Nats","Cruiser 1","Mini-Fleet","Matt Larson",2,400,530,0,1,0,null,null,null,"Mark Lide"]
["Nats","Cruiser 1","Mini-Fleet","Cameron Hunt",3,948.76923076923083,420,0,1,582.61538461538464,null,null,null,"Lee McKinzie",0]
["Nats","Cruiser 1","Mini-Fleet","Zach Hoernemann",3,266.66666666666663,1210,1,1,0,null,null,null,"Lou Meszaros"]
["Nats","Cruiser 2","Mini-Fleet","Eric Bitondo",3,441.47540983606564,2030,1,1,0,null,null,null,"Philip Pace",242.35288373161765]
["Nats","Cruiser 2","Mini-Fleet","Carl Bitondo",3,441.47540983606564,2510,2,1,0,null,null,null,"Tom Palmer"]
["Nats","Cruiser 2","Mini-Fleet","Kevin Plumer",3,641.47540983606564,1630,0,1,0,null,null,null,"Chris Pearce"]
["Nats","Cruiser 2","Mini-Fleet","Peter Ellison",4,1142.3529411764705,430,0,1,484.7057674632353,null,null,null,"Kevin Plumer",582.61538461538464]
["Nats","Cruiser 2","Mini-Fleet","John Jones",1,366.55737704918033,220,0,1,0,null,null,null,"Craig Singer",181.76466279871326]
["Nats","Cruiser 2","Mini-Fleet","Kas Gaigalas",2,349.8360655737705,850,1,1,0,null,null,null,"Caleb Smith",1092.9230769230769]
["Nats","Cruiser 2","Mini-Fleet","Craig Singer",2,428.38235294117652,940,1,0,181.76466279871326,null,null,null,"Tom Tanner",1006.7329311457155]
["Nats","Cruiser 2","Mini-Fleet","Michael Smith",2,856.76470588235304,270,0,1,363.52932559742652,null,null,null,"Andy Terpstra",363.52932559742652]
["Nats","Cruiser 2","Mini-Fleet","Cameron Hunt",3,641.47540983606564,420,0,1,0,null,null,null,"William Tustin",525]
["Nats","Cruiser 2","Mini-Fleet","Bob Hoernemann",3,999.55882352941171,810,0,1,424.11754653033086,null,null,null,"Rick Whitsell"]
["Nats","Cruiser 2","Mini-Fleet","Zach Hoernemann",3,999.55882352941171,270,0,1,424.11754653033086,null,null,null,"Alex Hampton"]
["Nats","Cruiser 2","Mini-Fleet","Andy Terpstra",2,656.76470588235304,780,1,1,363.52932559742652,null,null,null,"Blue"]
["Nats","Cruiser 2","Mini-Fleet","Steve Andrews",3,999.55882352941171,760,0,1,424.11754653033086,null,null,null,"Cameron Hunt",582.61538461538464]
["Nats","Cruiser 2","Mini-Fleet","Caleb Smith",1,366.55737704918033,510,0,1,0,null,null,null,"Carl Bitondo",582.61538461538464]
["Nats","Cruiser 2","Mini-Fleet","Philip Pace",1,571.17647058823525,10,0,1,242.35288373161765,null,null,null,"Eric Bitondo",582.61538461538464]
["Nats","Cruiser 2","Mini-Fleet","Matt Mullis",3,999.55882352941171,190,0,1,424.11754653033086,null,null,null,"John Zaruba",249.69230769230771]
["Nats","Cruiser 2","Mini-Fleet","John Zaruba",2,349.8360655737705,1030,1,1,0,null,null,null,"Justin Ragucci",640]
["Nats","Cruiser 2","Mini-Fleet","Tom Tanner",3,999.55882352941171,840,0,1,424.11754653033086,null,null,null,"Kevin Sundberg",525]
["Nats","Cruiser 2","Mini-Fleet","Tyler Helland",2,549.8360655737705,360,0,1,0,null,null,null,"Matt Larson",363.52932559742652]
["Nats","Cruiser 2","Mini-Fleet","McCoy Helland",3,641.47540983606564,150,0,1,0,null,null,null,"Matt Mullis",424.11754653033086]
["Nats","Cruiser 2","Mini-Fleet","Matt Larson",2,856.76470588235304,290,0,1,363.52932559742652,null,null,null,"Michael Smith",363.52932559742652]
["Nats","Matt v Caleb 1","Individual","Caleb Smith",4,2550,1990,1,1,760,null,null,null,"Red"]
["Nats","Matt v Caleb 1","Individual","Matt Andrews",5,1790,2750,1,1,0,null,null,null,"Robert Stalnaker"]
["Nats","Matt v Justin 1","Individual","Matt Andrews",5,530,1170,0,1,0,null,null,null,"Ron Hunt"]
["Nats","Matt v Justin 1","Individual","Justin Ragucci",5,1170,530,0,1,640,null,null,null,"Ted Buehring"]
["Nats","Steve v Justin 1","Individual","Steve Andrews",5,1680,1620,0,1,60,null,null,null,"Grand Total",12039.999023437502]
["Nats","Steve v Justin 1","Individual","Justin Ragucci",5,1620,1680,0,1,0]
["Nats","Thurs Campaign","Fleet","Red",8,75800,0,0,0]
["Nats","Thurs Campaign","Fleet","Blue",8,68150,0,0,0]
["Nats","Friday 1","Fleet","Lou Meszaros",4,1223.8674033149171,1050,0,1]
["Nats","Friday 1","Fleet","Tom Palmer",5,1176.8508287292816,3950,1,1]
["Nats","Friday 1","Fleet","Ron Hunt",3,535.44198895027625,550,0,0]
["Nats","Friday 1","Fleet","Cameron Hunt",3,1070.8839779005525,330,0,1]
["Nats","Friday 1","Fleet","Bob Hoernemann",6,1452.4691358024691,1290,0,1]
["Nats","Friday 1","Fleet","Carl Bitondo",3,1086.7283950617284,560,0,1]
["Nats","Friday 1","Fleet","Eric Bitondo",3,1086.7283950617284,900,0,1]
["Nats","Friday 1","Fleet","Kevin Sundberg",5,1376.8508287292816,240,0,1]
["Nats","Friday 1","Fleet","John Zaruba",4,1223.8674033149171,2370,0,1]
["Nats","Friday 1","Fleet","Lee McKinzie",5,1176.8508287292816,3220,1,1]
["Nats","Friday 1","Fleet","Matt Mullis",3,1070.8839779005525,10,0,1]
["Nats","Friday 1","Fleet","Rob Arena",5,1376.8508287292816,730,0,1]
["Nats","Friday 1","Fleet","Brian Koehler",5,1397.2222222222222,820,0,1]
["Nats","Friday 1","Fleet","Ken Arena",5,688.4254143646408,1620,1,0]
["Nats","Friday 1","Fleet","Nate Graham",1,411.93370165745853,860,2,1]
["Nats","Friday 1","Fleet","Alex Hampton",4,620.98765432098764,1900,1,0]
["Nats","Friday 1","Fleet","Zach Hoernemann",6,1552.4691358024691,1020,0,1]
["Nats","Friday 1","Fleet","Kevin Plumer",5,1176.8508287292816,1890,1,1]
["Nats","Friday 1","Fleet","Andy Terpstra",6,1552.4691358024691,2700,0,1]
["Nats","Friday 1","Fleet","Chris Pearce",6,1529.8342541436464,610,0,1]
["Nats","Friday 1","Fleet","Brian Lamb",3,1070.8839779005525,310,0,1]
["Nats","Friday 1","Fleet","Matt Andrews",5,1376.8508287292816,600,0,1]
["Nats","Friday 1","Fleet","Steve Andrews",5,1376.8508287292816,500,0,1]
["Nats","Friday 1","Fleet","Carl Camurati",4,1023.8674033149171,1380,1,1]
["Nats","Friday 1","Fleet","Tom Tanner",4,1241.9753086419753,800,0,1]
["Nats","Friday 1","Fleet","Justin Ragucci",5,1397.2222222222222,950,0,1]
["Nats","Friday 1","Fleet","Kas Gaigalas",6,1529.8342541436464,540,0,1]
["Nats","Friday 1","Fleet","Caleb Smith",4,611.93370165745853,1990,1,0]
["Nats","Friday 1","Fleet","Caleb Smith",1,305.96685082872926,0,0,0]
["Nats","Friday 1","Fleet","Timothy Beckett",6,1529.8342541436464,1250,0,1]
["Nats","Friday 1","Fleet","Tyler Helland",7,1552.4691358024691,3840,0,1]
["Nats","Friday 1","Fleet","McCoy Helland",3,1086.7283950617284,170,0,1]
["Nats","Friday 1","Fleet","Robert Stalnaker",5,1197.2222222222222,1120,1,1]
["Nats","Friday 1","Fleet","Craig Singer",6,1529.8342541436464,360,0,1]
["Nats","Friday 1","Fleet","William Tustin",5,1376.8508287292816,600,0,1]
["Nats","Friday 1","Fleet","Ted Buehring",4,1241.9753086419753,800,0,1]
["Nats","Friday 1","Fleet","Mark Lide",6,1552.4691358024691,1540,0,1]
["Nats","Friday 1","Fleet","Jeff Lide",7,1352.4691358024691,5110,1,1]
["Nats","Friday 1","Fleet","Michael Smith",4,1041.9753086419753,1670,1,1]
["Nats","Friday 1","Fleet","Peter Ellison",4,1041.9753086419753,1580,1,1]
["Nats","Friday 1","Fleet","Philip Pace",1,620.98765432098764,110,0,1]
["Nats","Friday 1","Fleet","John Jones",1,620.98765432098764,220,0,1]
["Nats","Friday 1","Fleet","Rick Whitsell",2,917.90055248618785,190,0,1]
["Nats","Friday 1","Fleet","Matt Larson",6,1552.4691358024691,590,0,1]
["Nats","Duke Dance ","Mini-Fleet","Matt Andrews",5,1323.3333333333333,1960,0,1,0]
["Nats","Duke Dance ","Mini-Fleet","Steve Andrews",5,1323.3333333333333,1330,0,1,0]
["Nats","Duke Dance ","Mini-Fleet","Ken Arena",5,1123.3333333333333,1730,1,1,0]
["Nats","Duke Dance ","Mini-Fleet","Kevin Sundberg",5,2310,2150,1,1,525]
["Nats","Duke Dance ","Mini-Fleet","William Tustin",5,2510,1820,0,1,525]

{"sheet":"BattleSummary","index":2,"n_rows":49,"n_cols":46,"rows_kept":49,"cut":false,"hidden":false,"merged":[[6,0,6,6]]}
["Event",null,null,null,null,null,null,null,"Award","Captain","Score","Tie?",null,null,"List of Battles",null,"Points","Class",null,null,null,null,null,null,null,null,"Battles","Class",null,null,null,null,null,null,null,"Average","Class",null,null,null,null,null,null,null,"Individual"]
[null,null,null,null,null,null,null,null,"Individual ","N/A",0,"Yes",null,null,"MI Jul",null,"Captain",1,2,3,4,5,6,7,null,null,"Captain",1,2,3,4,5,6,7,null,"Captain",1,2,3,4,5,6,7,null,"Captain","Points"]
["Fleet Battles",8,null,null,null,null,null,null,"Most Damaged (w/ sink)","Tyler Helland",6130,null,null,null,"MI Aug",null,"Matt Larson",null,null,null,null,null,7552.0358221261213,null,null,null,"Matt Larson",null,null,null,null,null,5,null,null,"Matt Larson",null,null,null,null,null,755.2035822126121,null,null,"Matt Larson",0]
[null,null,null,null,null,null,null,null,"Most Damaged (w/o sink)","Tyler Helland",3840,null,null,null,"MI Sep",null,"Kas Gaigalas",null,null,null,null,null,7425.7707522844175,null,null,null,"Kas Gaigalas",null,null,null,null,null,6,null,null,"Kas Gaigalas",null,null,null,null,null,618.81422935703483,null,null,"Kas Gaigalas",0]
[null,null,null,null,null,null,null,null,null,null,null,null,null,null,"MI Oct",null,"Steve Andrews",null,null,null,null,6683.1936770559751,null,null,null,null,"Steve Andrews",null,null,null,null,6,null,null,null,"Steve Andrews",null,null,null,null,556.93280642133129,null,null,null,"Steve Andrews",0]
[null,null,null,null,null,null,null,null,null,null,null,null,null,null,"PA Sep",null,"Robert Stalnaker",null,null,null,null,6376.8322399135086,null,null,null,null,"Robert Stalnaker",null,null,null,null,5,null,null,null,"Robert Stalnaker",null,null,null,null,637.68322399135081,null,null,null,"Robert Stalnaker",0]
["Fleet Battle Summary",null,null,null,null,null,null,null,"High Sortie Average","Captain","Score","No. of Captains","Tie?",null,"PA Set",null,"Caleb Smith",505.12600998788844,null,null,4530.3645818517571,null,null,null,null,null,"Caleb Smith",2,null,null,6,null,null,null,null,"Caleb Smith",126.28150249697211,null,null,377.53038182097976,null,null,null,null,"Caleb Smith",0]
["Battle","Fleet 1","Fleet 1 Score","Fleet 2","Fleet 2 Score","Winning Fleet","Points Difference",null,"Class 1","John Jones",310.08143288504482,5,"Yes",null,"PA Sep",null,"Jeff Lide",null,null,null,null,null,null,8158.3380482797402,null,null,"Jeff Lide",null,null,null,null,null,null,5,null,"Jeff Lide",null,null,null,null,null,null,815.83380482797406,null,"Jeff Lide",0]
["Mon 1","Red",25709.998046875,"Blue",31019.998046875,"Blue",5310,null,"Class 2","Brian Koehler",441.66666666666669,2,"No",null,"NC Oct",null,"Tom Palmer",null,null,null,null,5835.0855689478667,null,null,null,null,"Tom Palmer",null,null,null,null,6,null,null,null,"Tom Palmer",null,null,null,null,486.25713074565556,null,null,null,"Tom Palmer",0]
["Mon 2","Red",23770.001953125,"Blue",24169.998046875,"Blue",399.99609375,null,"Class 3","Tom Tanner",571.42105263157885,11,"No",null,"GA Feb",null,"Andy Terpstra",null,null,null,null,null,7752.0358221261213,null,null,null,"Andy Terpstra",null,null,null,null,null,5,null,null,"Andy Terpstra",null,null,null,null,null,775.2035822126121,null,null,"Andy Terpstra",0]
["Tues 1","Red",16580,"Blue",26300,"Blue",9720,null,"Class 4","Gerald Roberts",559.55182072829132,12,"No",null,"MI May",null,"Rick Whitsell",null,4156.7237126319123,null,null,null,null,null,null,null,"Rick Whitsell",null,6,null,null,null,null,null,null,"Rick Whitsell",null,346.39364271932601,null,null,null,null,null,null,"Rick Whitsell",0]
["Tues Campaign","Red",73375,"Blue",88550,"Blue",15175,null,"Class 5","Justin Ragucci",697.68322399135081,13,"No",null,"MN Sep",null,"Ken Arena",null,null,null,null,5266.6800273972167,null,null,null,null,"Ken Arena",null,null,null,null,5,null,null,null,"Ken Arena",null,null,null,null,526.66800273972171,null,null,null,"Ken Arena",0]
["Wed 1","Red",3990,"Blue",1690,"Red",2300,null,"Class 6","Andy Terpstra",775.2035822126121,12,"Yes",null,"LA Mar",null,"William Tustin",null,null,null,null,5955.1054417618579,null,null,null,null,"William Tustin",null,null,null,null,5,null,null,null,"William Tustin",null,null,null,null,595.51054417618582,null,null,null,"William Tustin",0]
["Thurs 1","Red",29309.994140625,"Blue",27440.001953125,"Red",1869.9921875,null,"Class 7","Jeff Lide",815.83380482797406,3,"Yes",null,"GA Sep",null,"Michael Smith",null,null,null,5101.6286577008968,null,null,null,null,null,"Michael Smith",null,null,null,5,null,null,null,null,"Michael Smith",null,null,null,510.1628657700897,null,null,null,null,"Michael Smith",0]
["Thurs Campaign","Red",75800,"Blue",68650,"Red",7150,null,null,null,null,null,null,null,"GA May",null,"Peter Ellison",null,null,null,5242.0768369726056,null,null,null,null,null,"Peter Ellison",null,null,null,5,null,null,null,null,"Peter Ellison",null,null,null,524.20768369726056,null,null,null,null,"Peter Ellison",0]
["Friday 1","Red",27689.998046875,"Blue",25050,"Red",2639.998046875,null,null,null,null,null,null,null,"NC Apr",null,"Lee McKinzie",null,null,null,null,5555.1054417618579,null,null,null,null,"Lee McKinzie",null,null,null,null,5,null,null,null,"Lee McKinzie",null,null,null,null,555.51054417618582,null,null,null,"Lee McKinzie",0]
[null,null,null,null,null,null,null,null,null,null,null,null,null,null,"MI May",null,"Gerald Roberts",null,null,null,1119.1036414565826,null,4600.687134502924,null,null,null,"Gerald Roberts",null,null,null,1,null,3,null,null,"Gerald Roberts",null,null,null,559.55182072829132,null,766.78118908382066,null,null,"Gerald Roberts",0]
[null,null,null,null,null,null,null,null,null,null,null,null,null,null,"PA Jun",null,"Tom Tanner",null,null,1142.8421052631577,5283.3494814995247,null,null,null,null,null,"Tom Tanner",null,null,1,5,null,null,null,null,"Tom Tanner",null,null,571.42105263157885,528.33494814995242,null,null,null,null,"Tom Tanner",0]
[null,null,null,null,null,null,null,null,null,null,null,null,null,null,"MN May",null,"Chris Pearce",null,null,null,null,null,7425.7707522844175,null,null,null,"Chris Pearce",null,null,null,null,null,6,null,null,"Chris Pearce",null,null,null,null,null,618.81422935703483,null,null,"Chris Pearce",0]
["Total",null,{"$f":"SUM(C9:C18)","v":276224.9921875},null,{"$f":"SUM(E9:E18)","v":292869.998046875},"Blue",{"$f":"E20-C20","v":16645.005859375},null,null,null,null,null,null,null,"LA Nov",null,"Brian Lamb",null,null,2204.4198895027621,null,null,3689.834775683833,null,null,null,"Brian Lamb",null,null,2,null,null,3,null,null,"Brian Lamb",null,null,551.10497237569052,null,null,614.9724626139722,null,null,"Brian Lamb",0]
[null,null,null,null,null,null,null,null,null,null,null,null,null,null,"Nats",null,"Carl Camurati",null,null,null,3115.973653211222,null,null,3032.8467758656443,null,null,"Carl Camurati",null,null,null,3,null,null,2,null,"Carl Camurati",null,null,null,519.32894220187029,null,null,758.21169396641108,null,"Carl Camurati",0]
[null,null,null,null,null,null,null,null,null,null,null,null,null,null,null,null,"Brian Koehler",null,883.33333333333337,null,null,4822.3364415941815,null,null,null,null,"Brian Koehler",null,1,null,null,4,null,null,null,"Brian Koehler",null,441.66666666666669,null,null,602.79205519927268,null,null,null,"Brian Koehler",0]
[null,null,null,null,null,null,null,null,null,null,null,null,null,null,null,null,"McCoy Helland",null,null,5426.4250754882851,null,null,null,null,null,null,"McCoy Helland",null,null,5,null,null,null,null,null,"McCoy Helland",null,null,542.64250754882846,null,null,null,null,null,"McCoy Helland",0]
[null,null,null,null,null,null,null,null,null,null,null,null,null,null,null,null,"Nate Graham",411.93370165745853,null,null,null,4378.2546130325763,null,null,null,null,"Nate Graham",1,null,null,null,4,null,null,null,"Nate Graham",205.96685082872926,null,null,null,547.28182662907204,null,null,null,"Nate Graham",0]
[null,null,null,null,null,null,null,null,null,null,null,null,null,null,null,null,"Tyler Helland",null,null,null,null,null,null,8158.3380482797402,null,null,"Tyler Helland",null,null,null,null,null,null,5,null,"Tyler Helland",null,null,null,null,null,null,815.83380482797406,null,"Tyler Helland",0]
[null,null,null,null,null,null,null,null,null,null,null,null,null,null,null,null,"John Jones",3100.8143288504484,null,null,null,null,null,null,null,null,"John Jones",5,null,null,null,null,null,null,null,"John Jones",310.08143288504482,null,null,null,null,null,null,null,"John Jones",0]
[null,null,null,null,null,null,null,null,null,null,null,null,null,null,null,null,"Alex Hampton",null,null,null,4368.0365510726706,null,null,null,null,null,"Alex Hampton",null,null,null,5,null,null,null,null,"Alex Hampton",null,null,null,436.80365510726705,null,null,null,null,"Alex Hampton",0]
[null,null,null,null,null,null,null,null,null,null,null,null,null,null,null,null,"Ginger Andrews",null,null,2382.884342978683,null,null,null,null,null,null,"Ginger Andrews",null,null,3,null,null,null,null,null,"Ginger Andrews",null,null,397.14739049644714,null,null,null,null,null,"Ginger Andrews",0]
[null,null,null,null,null,null,null,null,null,null,null,null,null,null,null,null,"Kevin Sundberg",null,null,null,null,3921.0713990819277,null,null,null,null,"Kevin Sundberg",null,null,null,null,4,null,null,null,"Kevin Sundberg",null,null,null,null,490.13392488524096,null,null,null,"Kevin Sundberg",0]
[null,null,null,null,null,null,null,null,null,null,null,null,null,null,null,null,"Eric Bitondo",null,null,5426.4250754882851,null,null,null,null,null,null,"Eric Bitondo",null,null,5,null,null,null,null,null,"Eric Bitondo",null,null,542.64250754882846,null,null,null,null,null,"Eric Bitondo",0]
[null,null,null,null,null,null,null,null,null,null,null,null,null,null,null,null,"Carl Bitondo",null,null,5226.4250754882851,null,null,null,null,null,null,"Carl Bitondo",null,null,5,null,null,null,null,null,"Carl Bitondo",null,null,522.64250754882846,null,null,null,null,null,"Carl Bitondo",0]
[null,null,null,null,null,null,null,null,null,null,null,null,null,null,null,null,"Matt Andrews",null,null,null,null,3730.4703598626247,2694.0389798880369,null,null,null,"Matt Andrews",null,null,null,null,3,2,null,null,"Matt Andrews",null,null,null,null,621.74505997710412,673.50974497200923,null,null,"Matt Andrews",0]
[null,null,null,null,null,null,null,null,null,null,null,null,null,null,null,null,"Kevin Plumer",null,null,null,596.63663663663658,5386.9774608397593,null,null,null,null,"Kevin Plumer",null,null,null,1,5,null,null,null,"Kevin Plumer",null,null,null,298.31831831831829,538.69774608397597,null,null,null,"Kevin Plumer",0]
[null,null,null,null,null,null,null,null,null,null,null,null,null,null,null,null,"Matt Mullis",null,null,5871.3810626829418,null,null,null,null,null,null,"Matt Mullis",null,null,6,null,null,null,null,null,"Matt Mullis",null,null,489.2817552235785,null,null,null,null,null,"Matt Mullis",0]
[null,null,null,null,null,null,null,null,null,null,null,null,null,null,null,null,"Philip Pace",3100.8143288504484,null,null,null,null,null,null,null,null,"Philip Pace",5,null,null,null,null,null,null,null,"Philip Pace",310.08143288504482,null,null,null,null,null,null,null,"Philip Pace",0]
[null,null,null,null,null,null,null,null,null,null,null,null,null,null,null,null,"Zach Hoernemann",null,null,null,null,null,7652.0358221261213,null,null,null,"Zach Hoernemann",null,null,null,null,null,5,null,null,"Zach Hoernemann",null,null,null,null,null,765.2035822126121,null,null,"Zach Hoernemann",0]
[null,null,null,null,null,null,null,null,null,null,null,null,null,null,null,null,"Cameron Hunt",null,null,1637.6519337016575,2155.2311839104295,null,null,null,null,null,"Cameron Hunt",null,null,2,2,null,null,null,null,"Cameron Hunt",null,null,409.41298342541438,538.80779597760738,null,null,null,null,"Cameron Hunt",0]
[null,null,null,null,null,null,null,null,null,null,null,null,null,null,null,null,"John Zaruba",null,null,null,6510.1497859233623,null,null,null,null,null,"John Zaruba",null,null,null,6,null,null,null,null,"John Zaruba",null,null,null,542.51248216028023,null,null,null,null,"John Zaruba",0]
[null,null,null,null,null,null,null,null,null,null,null,null,null,null,null,null,"Justin Ragucci",null,null,null,null,6976.8322399135086,null,null,null,null,"Justin Ragucci",null,null,null,null,5,null,null,null,"Justin Ragucci",null,null,null,null,697.68322399135081,null,null,null,"Justin Ragucci",0]
[null,null,null,null,null,null,null,null,null,null,null,null,null,null,null,null,"Rob Arena",323.86740331491711,null,null,null,5426.4037843032947,null,null,null,null,"Rob Arena",1,null,null,null,5,null,null,null,"Rob Arena",161.93370165745856,null,null,null,542.64037843032952,null,null,null,"Rob Arena",0]
[null,null,null,null,null,null,null,null,null,null,null,null,null,null,null,null,"Ted Buehring",null,null,489.60784313725492,2307.6323925281613,null,null,null,null,null,"Ted Buehring",null,null,1,3,null,null,null,null,"Ted Buehring",null,null,244.80392156862746,384.60539875469357,null,null,null,null,"Ted Buehring",0]
[null,null,null,null,null,null,null,null,null,null,null,null,null,null,null,null,"Craig Singer",null,null,null,null,null,6639.0060464020644,null,null,null,"Craig Singer",null,null,null,null,null,5,null,null,"Craig Singer",null,null,null,null,null,663.90060464020644,null,null,"Craig Singer",0]
[null,null,null,null,null,null,null,null,null,null,null,null,null,null,null,null,"Mark Lide",null,null,null,null,null,7752.0358221261213,null,null,null,"Mark Lide",null,null,null,null,null,5,null,null,"Mark Lide",null,null,null,null,null,775.2035822126121,null,null,"Mark Lide",0]
[null,null,null,null,null,null,null,null,null,null,null,null,null,null,null,null,"Bob Hoernemann",null,null,489.60784313725492,null,null,6702.5960462157573,null,null,null,"Bob Hoernemann",null,null,1,null,null,5,null,null,"Bob Hoernemann",null,null,244.80392156862746,null,null,670.2596046215757,null,null,"Bob Hoernemann",0]
[null,null,null,null,null,null,null,null,null,null,null,null,null,null,null,null,"Timothy Beckett",null,null,null,null,null,6839.0060464020644,null,null,null,"Timothy Beckett",null,null,null,null,null,5,null,null,"Timothy Beckett",null,null,null,null,null,683.90060464020644,null,null,"Timothy Beckett",0]
[null,null,null,null,null,null,null,null,null,null,null,null,null,null,null,null,"Lou Meszaros",null,null,null,4341.0949470117612,null,null,null,null,null,"Lou Meszaros",null,null,null,4,null,null,null,null,"Lou Meszaros",null,null,null,542.63686837647015,null,null,null,null,"Lou Meszaros",0]
[null,null,null,null,null,null,null,null,null,null,null,null,null,null,null,null,"Red",null,null,null,null,null,null,null,149175,null,"Red",null,null,null,null,null,null,null,2,"Red",null,null,null,null,null,null,null,null,"Red",0]
[null,null,null,null,null,null,null,null,null,null,null,null,null,null,null,null,"Blue",null,null,null,null,null,null,null,157200,null,"Blue",null,null,null,null,null,null,null,2,"Blue",null,null,null,null,null,null,null,null,"Blue",0]
[null,null,null,null,null,null,null,null,null,null,null,null,null,null,null,null,"Ron Hunt",null,null,2079.7131946701329,null,null,null,null,null,null,"Ron Hunt",null,null,3,null,null,null,null,null,"Ron Hunt",null,null,346.61886577835548,null,null,null,null,null,"Ron Hunt",0]

{"sheet":"Nats Awards","index":3,"n_rows":29,"n_cols":1,"rows_kept":29,"cut":false,"hidden":false,"merged":[]}
["Awards"]
["Class 1"]
["Class 2"]
["Class 3"]
["Class 4"]
["Class 5"]
["Class 6"]
["Class 7"]
["Individual Combat"]
["Ball Breaker"]
["Best of Scale Warship"]
["Best of Scale Convoy"]
["Individual Combat Trophy"]
["Marty Hayes Life Line Award"]
["Technology Award"]
["Most Spectacular Sink"]
["Best Ram"]
["Fire Stick Award"]
["Most Damaged Sunk"]
["Most Damaged NOT Sunk"]
["Ring of Death"]
["Axis Spirit"]
["Allied Spirit"]
["Allied Most Feared"]
["Axis Most Feared"]
["Rookie of the Year"]
["Brian Spychalski Award"]
["Von Fluegel"]
["Fleet Award"]

{"sheet":"Potential Cap List","index":4,"n_rows":123,"n_cols":3,"rows_kept":123,"cut":false,"hidden":false,"merged":[]}
["Captains 2019","Present?","Current Member?"]
["Alex Hampton",1,"n"]
["Andy Terpstra",1,"y"]
["Bob Hoernemann",1,"y"]
["Brian Koehler",1,"y"]
["Brian Lamb",1,"y"]
["Caleb Smith",1,"y"]
["Cameron Hunt",1,"y"]
["Carl Bitondo",1,"y"]
["Carl Camurati",1,"y"]
["Chris Pearce",1,"y"]
["Craig Singer",1,"y"]
["Eric Bitondo",1,"y"]
["Gerald Roberts",1,"y"]
["Ginger Andrews",1,"y"]
["Jeff Lide",1,"y"]
["Jeff Zaruba",1,"y"]
["John Jones",1,"y"]
["John Zaruba",1,"y"]
["Justin Ragucci",1,"y"]
["Kas Gaigalas",1,"y"]
["Ken Arena",1,"y"]
["Kevin Plumer",1,"y"]
["Kevin Sundberg",1,"y"]
["Lee McKinzie",1,"y"]
["Mackinzyee Zaruba",1,"y"]
["Mark Lide",1,"y"]
["Matt Andrews",1,"y"]
["Matt Larson",1,"y"]
["Matt Mullis",1,"y"]
["McCoy Helland",1,"y"]
["Michael Smith",1,"y"]
["Nate Graham",1,"y"]
["Peter Ellison",1,"y"]
["Philip Pace",1,"y"]
["Rick Whitsell",1,"y"]
["Rob Arena",1,"y"]
["Robert Stalnaker",1,"y"]
["Ron Hunt",1,"y"]
["Steve Andrews",1,"y"]
["Ted Buehring",1,"y"]
["Timothy Beckett",1,"y"]
["Tom Palmer",1,"y"]
["Tom Tanner",1,"y"]
["Tyler Helland",1,"y"]
["William Tustin",1,"y"]
["Zach Hoernemann",1,"y"]
["Lou Meszaros",1,"y"]
["Amanda Seltzer"]
["Andrew Le",null,"y"]
["Austin Stephens",null,"y"]
["Barry Tighe",null,"y"]
["Bill Byrnes",null,"y"]
["Bob Amend",null,"y"]
["Brandon Graham"]
["Brandon Smith",null,"y"]
["Brennen Schultz",null,"y"]
["Bryan Box",null,"y"]
["Charley Stephens",null,"y"]
["Chase Hargraves",null,"y"]
["Chris Kessler",null,"y"]
["Christopher Gaigalas",null,"y"]
["Christopher Koehler",null,"y"]
["Clark Ward",null,"n"]
["Clint Jackson",null,"y"]
["D.W. Fluegel",null,"y"]
["David Haynes",null,"y"]
["David Ranier",null,"y"]
["David Simmons",null,"y"]
["David Vogtman",null,"y"]
["Don Cole",null,"y"]
["Erik Helland",null,"y"]
["Evan Fowler",null,"y"]
["Gary Powell",null,"y"]
["Hadrian Tucker",null,"y"]
["Heiko Dewald",null,"y"]
["Hudson Maiers",null,"y"]
["Isaac McKinzie",null,"y"]
["Jack Alvenus",null,"y"]
["James Foster",null,"y"]
["Jason Pagegala",null,"y"]
["Jason Schafer",null,"y"]
["Jeff Lipp",null,"y"]
["Jeffrey Poindexter",null,"y"]
["Joel Goodman",null,"y"]
["John Kriner",null,"y"]
["Johnny Adams",null,"y"]
["Julie Hayden ",null,"y"]
["Justin Stalnaker",null,"y"]
["Karl Smith",null,"y"]
["Ken Kelly",null,"y"]
["Kyle Scott",null,"y"]
["Lewis Beckett",null,"y"]
["Mark Kuntz",null,"y"]
["Mark Roe",null,"y"]
["Mary Tighe",null,"y"]
["Matthew Webb",null,"y"]
["Michael Butts",null,"y"]
["Michael Pagegala",null,"y"]
["Michael Tanzillo",null,"y"]
["Michael Thomas",null,"y"]
["Mike Mangus",null,"y"]
["Morgan Preston",null,"n"]
["Nathan Thompson",null,"y"]
["Neil Humble",null,"y"]
["Nick Myers",null,"y"]
["Paul Rye",null,"y"]
["Plato Avramides",null,"y"]
["Rick King",null,"y"]
["Rick Schultz",null,"y"]
["Robert Neumann",null,"y"]
["Sam Pearson",null,"y"]
["Samuel Durham",null,"n"]
["Sara Carter",null,"y"]
["Stan Watkins",null,"y"]
["Steve Crane",null,"y"]
["Sydnee McKinzie",null,"y"]
["Travis Chezick",null,"y"]
["Trey Schultz",null,"y"]
["Wade Koehn",null,"y"]
["Weston Dodge",null,"y"]
["Will Cover",null,"y"]
["William Brown",null,"n"]

{"sheet":"Captain","index":5,"n_rows":51,"n_cols":8,"rows_kept":51,"cut":false,"hidden":false,"merged":[]}
["Captian","Ship","Class","Units",null,null,null,"Enter \"Convoy\" for campaign battles"]
["Alex Hampton","Dreadnough",4,4]
["Andy Terpstra","Nagato",6,6]
["Bob Hoernemann","Nagato",6,6]
["Brian Koehler","QE",5,5.5]
["Brian Lamb","NC",6,6]
["Caleb Smith","Courbet",4,4.5]
["Cameron Hunt","Nassau",4,4]
["Carl Bitondo","Deutschland",3,3.5]
["Carl Camurati","Musashi",7,8]
["Chris Pearce","Bismark",6,6.5]
["Craig Singer","Bismark",6,6.5]
["Eric Bitondo","Deutschland",3,3.5]
["Gerald Roberts","Kongo",4,4.5]
["Ginger Andrews","Des Moines",3,3.5]
["Jeff Lide","Yamato",7,8]
["John Jones","Z Boat",1,1.5]
["John Zaruba","Andra Doria",4,4.5]
["Justin Ragucci","Rivadavia",5,5.5]
["Kas Gaigalas","Washington",6,6]
["Ken Arena","Iron Duke",5,5]
["Kevin Plumer","Scharnhorst",5,5.5]
["Kevin Sundberg","Iron Duke",5,5.5]
["Lee McKinzie","Iron Duke",5,5.5]
["Mark Lide","Nagato",6,6]
["Matt Andrews","VV",6,6.5]
["Matt Larson","Nagato",6,6]
["Matt Mullis","Prinz Eugen",3,3.5]
["McCoy Helland","Zara",3,3]
["Michael Smith","Seydlitz",4,4.5]
["Nate Graham","West Virginia",5,5.5]
["Peter Ellison","Erin",4,4.5]
["Philip Pace","Z Boat",1,1.5]
["Rick Whitsell","Jamaica",2,2.5]
["Rob Arena","Arizona",5,5.5]
["Robert Stalnaker","Baden",5,5.5]
["Ron Hunt","Duca",2,2.5]
["Steve Andrews","Iron Duke",5,5]
["Ted Buehring","VDT",4,4]
["Timothy Beckett","Bismark",6,6.5]
["Tom Palmer","QE",5,5.5]
["Tom Tanner","Ostfriesland",4,4.5]
["Tyler Helland","Yamato",7,8]
["William Tustin","Iron Duke",5,5]
["Zach Hoernemann","Nagato",6,6]
["Lou Meszaros","Courbet",4,4.5]
[null,"Gearing",1,1.5]
[null,"Radetzky",3,3.5]
[null,"Suffren",3,3]
[null,"Convoy",1,1]
[null,"Glorie",2,2.5]

{"sheet":"Campaign Master","index":6,"n_rows":17,"n_cols":43,"rows_kept":17,"cut":false,"hidden":false,"merged":[]}
[null,null,null,null,null,null,null,null,"Winner:",{"$f":"IF(K2>K3, B2, IF(K3>K2, B3, \"Tie\"))","v":"Tie"},null,null,"Battle Location and Month (i.e. MD May)","Nats",null,"Convoy Runs",null,null,null,null,null,null,"Sinks",null,null,null,null,null,"Convoy Friendly Ram",null,null,null,null,null,null,"Ram Penalties"]
["Fleet 1 :","Allied",null,null,null,"Fleet Points:",{"$f":"B15","v":0},"Fleet Penalties:",{"$f":"B16","v":0},"Fleet Score:",{"$f":"B17","v":0},null,"Battle Day","Tues",null,"Captain","Fleet","Ship","Ship Length","Number of Runs","Points",null,"Captain","Fleet","Ship","Class","Sink Points",null,"Ramming Captain","Fleet","Convoy Ship","Convoy Captain","Ship Length","Points",null,"Ramming Captain","Fleet","Ram Type","Rammed Captain","Rammed Ship","Rammed Ship Class","Ram Sink","Points"]
["Fleet 2 :","Axis",null,null,null,"Fleet Points:",{"$f":"C15","v":0},"Fleet Penalties:",{"$f":"C16","v":0},"Fleet Score:",{"$f":"C17","v":0}]
[]
["Fleet:",{"$f":"B2","v":"Allied"},{"$f":"B3","v":"Axis"}]
["Targets Remaining:"]
["Target Points:"]
["Convoy Run Points:"]
["Scuttled Convoy Points:"]
["Sink Points:"]
["Convoy Friendly Ram Points:"]
["Ram Penalty Points:"]
["No Ship on Water Points:"]
["Convoy Run Every 10 Min Points:"]
["Total Points:",{"$f":"B7+B8+B9+B10+B11+B13+B14","v":0},{"$f":"C7+C8+C9+C10+C11+C13+C14","v":0}]
["Total Penalties:",{"$f":"B12","v":0},{"$f":"C12","v":0}]
["Fleet Score:",{"$f":"B15-B16","v":0},{"$f":"C15-C16","v":0}]

{"sheet":"Master","index":7,"n_rows":4,"n_cols":20,"rows_kept":4,"cut":false,"hidden":false,"merged":[]}
[null,null,null,null,null,null,null,null,"Winner:",{"$f":"IF(K2>K3, B2, IF(K3>K2, B3, \"Tie\"))","v":"Tie"},null,"Battle Type","Battle Location and Month (i.e. MD May)",null,null,null,null,null,"Fleet"]
["Fleet 1 :","Flag",null,"Fleet Units:",null,"Fleet Weight:",null,"Fleet Battle Damage:",null,"Fleet Score:",null,null,"Battle Day",null,null,null,null,null,"Mini-Fleet"]
["Fleet 2 :","No Flag",null,"Fleet Units:",null,"Fleet Weight:",null,"Fleet Battle Damage:",null,"Fleet Score:",null,null,"Battle Number",null,null,null,null,null,"Individual"]
["Captian","Ship","Fleet","Class","Units","Above","On","Below","Sinks","Participate all Sorties","Penalties Points","2nd Sortie Sink","Damage Points","Scored By","Notes","Weight Factor","Weight Points","Captian","Captain Points","Indiv Points"]

{"sheet":"Nats Duke Dance ","index":8,"n_rows":9,"n_cols":20,"rows_kept":9,"cut":false,"hidden":false,"merged":[]}
[null,null,null,null,null,null,null,null,"Winner:",{"$f":"IF(K2>K3, B2, IF(K3>K2, B3, \"Tie\"))","v":"No Flag"},null,"Battle Type","Battle Location and Month (i.e. MD May)","Nats",null,null,null,null,"Fleet"]
["Fleet 1 :","Flag",null,"Fleet Units:",15,"Fleet Weight:",27,"Fleet Battle Damage:",5020,"Fleet Score:",3970,null,"Battle Day","Duke Dance",null,null,null,null,"Mini-Fleet"]
["Fleet 2 :","No Flag",null,"Fleet Units:",10,"Fleet Weight:",18,"Fleet Battle Damage:",3970,"Fleet Score:",5020,null,"Battle Number",null,null,null,null,null,"Individual"]
["Captian","Ship","Fleet","Class","Units","Above","On","Below","Sinks","Participate all Sorties","Penalties Points","2nd Sortie Sink","Damage Points","Scored By","Notes","Weight Factor","Weight Points","Captian","Captain Points","Indiv Points"]
["Matt Andrews","Iron Duke","Flag",5,5,74,7,36,0,1,0,0,1960,"Matt A","None,None,None",9,1323.3333333333333,"Matt Andrews",1323.3333333333333,0]
["Steve Andrews","Iron Duke","Flag",5,5,41,7,26,0,1,0,0,1330,"Steve","None,None,None",9,1323.3333333333333,"Steve Andrews",1323.3333333333333,0]
["Ken Arena","Iron Duke","Flag",5,5,28,2,17,1,1,0,1,1730,"Rob","None,None,None",9,1323.3333333333333,"Ken Arena",1123.3333333333333,0]
["Kevin Sundberg","Iron Duke","No Flag",5,5,29,3,30,1,1,0,1,2150,"Kevin","None,None,None",9,2510,"Kevin Sundberg",2310,525]
["William Tustin","Iron Duke","No Flag",5,5,89,6,27,0,1,0,0,1820,"Will","None,None,None",9,2510,"William Tustin",2510,525]

{"sheet":"Nats Friday 1","index":9,"n_rows":48,"n_cols":20,"rows_kept":48,"cut":false,"hidden":false,"merged":[]}
[null,null,null,null,null,null,null,null,"Winner:",{"$f":"IF(K2>K3, B2, IF(K3>K2, B3, \"Tie\"))","v":"Red"},null,"Battle Type","Battle Location and Month (i.e. MD May)","Nats",null,null,null,null,"Fleet"]
["Fleet 1 :","Red",null,"Fleet Units:",108.5,"Fleet Weight:",181,"Fleet Battle Damage:",25150,"Fleet Score:",27689.998046875,null,"Battle Day","Friday",null,null,null,null,"Mini-Fleet"]
["Fleet 2 :","Blue",null,"Fleet Units:",97,"Fleet Weight:",162,"Fleet Battle Damage:",27690,"Fleet Score:",25050,null,"Battle Number",1,null,null,null,null,"Individual"]
["Captian","Ship","Fleet","Class","Units","Above","On","Below","Sinks","Participate all Sorties","Penalties Points","2nd Sortie Sink","Damage Points","Scored By","Notes","Weight Factor","Weight Points","Captian","Captain Points","Indiv Points"]
["Lou Meszaros","Courbet","Red",4,4.5,32,11,17,0,1,0,0,1050,"Eric","None,None,None",8,1223.8674033149171,"Lou Meszaros",1223.8674033149171]
["Tom Palmer","QE","Red",5,5.5,93,22,56,1,1,0,1,3950,"Zach","None,None,None",9,1376.8508287292816,"Tom Palmer",1176.8508287292816]
["Ron Hunt","Zara","Red",3,3,6,2,15,0,0,0,0,550,"Andy","None,None,None",3.5,535.44198895027625,"Ron Hunt",535.44198895027625]
["Cameron Hunt","Deutschland","Red",3,3.5,15,3,4,0,1,0,0,330,"McCoy","None,None,None",7,1070.8839779005525,"Cameron Hunt",1070.8839779005525]
["Bob Hoernemann","Nagato","Blue",6,6,63,6,18,0,1,100,0,1290,"Brian","Ram above Kas,None,None",10,1452.4691358024691,"Bob Hoernemann",1452.4691358024691]
["Carl Bitondo","Deutschland","Blue",3,3.5,33,4,5,0,1,0,0,560,"Kevin S","None,None,None",7,1086.7283950617284,"Carl Bitondo",1086.7283950617284]
["Eric Bitondo","Deutschland","Blue",3,3.5,37,1,17,0,1,0,0,900,"Kevin","None,None,None",7,1086.7283950617284,"Eric Bitondo",1086.7283950617284]
["Kevin Sundberg","Iron Duke","Red",5,5,3,0,7,0,1,0,0,240,"Tom T","None,None,None",9,1376.8508287292816,"Kevin Sundberg",1376.8508287292816]
["John Zaruba","Andra Doria","Red",4,4.5,92,5,45,0,1,0,0,2370,"Tyler","None,None,None",8,1223.8674033149171,"John Zaruba",1223.8674033149171]
["Lee McKinzie","Iron Duke","Red",5,5,76,15,42,1,1,0,1,3220,"Andy","None,None,None",9,1376.8508287292816,"Lee McKinzie",1176.8508287292816]
["Matt Mullis","Prinz Eugen","Red",3,3.5,1,0,0,0,1,0,0,10,"Matt L","None,None,None",7,1070.8839779005525,"Matt Mullis",1070.8839779005525]
["Rob Arena","Arizona","Red",5,5.5,29,4,12,0,1,0,0,730,"Eric","None,None,None",9,1376.8508287292816,"Rob Arena",1376.8508287292816]
["Brian Koehler","QE","Blue",5,5.5,28,3,16,0,1,0,0,820,"Ken","None,None,None",9,1397.2222222222222,"Brian Koehler",1397.2222222222222]
["Ken Arena","Iron Duke","Red",5,5,12,6,16,1,0,0,0,1620,"Brian","None,None,None",4.5,688.4254143646408,"Ken Arena",688.4254143646408]
["Nate Graham","Z Boat","Red",1,1.5,6,0,0,2,1,0,1,860,"Tom T","None,None,None",4,611.93370165745853,"Nate Graham",411.93370165745853]
["Alex Hampton","Dreadnough","Blue",4,4,76,5,8,1,0,0,0,1900,"Will","None,None,None",4,620.98765432098764,"Alex Hampton",620.98765432098764]
["Zach Hoernemann","Nagato","Blue",6,6,19,4,25,0,1,0,0,1020,"Ron","None,None,None",10,1552.4691358024691,"Zach Hoernemann",1552.4691358024691]
["Kevin Plumer","Scharnhorst","Red",5,5.5,42,0,19,1,1,0,1,1890,"Tyler","None,None,None",9,1376.8508287292816,"Kevin Plumer",1176.8508287292816]
["Andy Terpstra","Nagato","Blue",6,6,82,19,50,0,1,0,0,2700,"caleb","None,None,None",10,1552.4691358024691,"Andy Terpstra",1552.4691358024691]
["Chris Pearce","Bismark","Red",6,6.5,23,4,10,0,1,0,0,610,"Andy","None,None,None",10,1529.8342541436464,"Chris Pearce",1529.8342541436464]
["Brian Lamb","Deutschland","Red",3,3.5,10,0,7,0,1,0,0,310,"Justin","None,None,None",7,1070.8839779005525,"Brian Lamb",1070.8839779005525]
["Matt Andrews","Iron Duke","Red",5,5,22,7,8,0,1,0,0,600,"Justin","None,None,None",9,1376.8508287292816,"Matt Andrews",1376.8508287292816]
["Steve Andrews","Iron Duke","Red",5,5,20,3,8,0,1,0,0,500,"Justin","None,None,None",9,1376.8508287292816,"Steve Andrews",1376.8508287292816]
["Carl Camurati","Nassau","Red",4,4,34,3,6,1,1,0,1,1380,"Tom ","None,None,None",8,1223.8674033149171,"Carl Camurati",1023.8674033149171]
["Tom Tanner","Ostfriesland","Blue",4,4.5,36,4,12,0,1,0,0,800,"carl","None,None,None",8,1241.9753086419753,"Tom Tanner",1241.9753086419753]
["Justin Ragucci","Rivadavia","Blue",5,5.5,35,3,18,0,1,0,0,950,"Rob","None,None,None",9,1397.2222222222222,"Justin Ragucci",1397.2222222222222]
["Kas Gaigalas","Washington","Red",6,6,18,6,8,0,1,0,0,540,"Justin","None,None,None",10,1529.8342541436464,"Kas Gaigalas",1529.8342541436464]
["Caleb Smith","Courbet","Red",4,4.5,39,7,22,1,0,0,0,1990,"Justin","None,None,None",4,611.93370165745853,"Caleb Smith",611.93370165745853]
["Caleb Smith","Z Boat","Red",1,1.5,0,0,0,0,0,0,0,0,"Caleb","None,None,None",2,305.96685082872926,"Caleb Smith",305.96685082872926]
["Timothy Beckett","Bismark","Red",6,6.5,23,9,28,0,1,0,0,1250,"Gerald","None,None,None",10,1529.8342541436464,"Timothy Beckett",1529.8342541436464]
["Tyler Helland","Yamato","Blue",7,8,181,37,43,0,1,0,0,3840,"Tim","None,None,None",10,1552.4691358024691,"Tyler Helland",1552.4691358024691]
["McCoy Helland","Zara","Blue",3,3,2,3,3,0,1,0,0,170,"Cameron","None,None,None",7,1086.7283950617284,"McCoy Helland",1086.7283950617284]
["Robert Stalnaker","Baden","Blue",5,5.5,4,0,6,1,1,0,1,1120,"Rob A","None,None,None",9,1397.2222222222222,"Robert Stalnaker",1197.2222222222222]
["Craig Singer","Bismark","Red",6,6.5,4,7,6,0,1,0,0,360,"Ted","None,None,None",10,1529.8342541436464,"Craig Singer",1529.8342541436464]
["William Tustin","Iron Duke","Red",5,5,14,8,10,0,1,0,0,600,"Alex","None,None,None",9,1376.8508287292816,"William Tustin",1376.8508287292816]
["Ted Buehring","VDT","Blue",4,4,36,7,10,0,1,0,0,800,"Craig","None,None,None",8,1241.9753086419753,"Ted Buehring",1241.9753086419753]
["Mark Lide","Nagato","Blue",6,6,61,9,25,0,1,0,0,1540,"Matt A","None,None,None",10,1552.4691358024691,"Mark Lide",1552.4691358024691]
["Jeff Lide","Yamato","Blue",7,8,222,23,41,1,1,0,1,5110,"Kevin P","None,None,None",10,1552.4691358024691,"Jeff Lide",1352.4691358024691]
["Michael Smith","Seydlitz","Blue",4,4.5,52,7,7,1,1,0,1,1670,"Matt A","None,None,None",8,1241.9753086419753,"Michael Smith",1041.9753086419753]
["Peter Ellison","Erin","Blue",4,4.5,51,6,5,1,1,0,1,1580,"Lou","None,None,None",8,1241.9753086419753,"Peter Ellison",1041.9753086419753]
["Philip Pace","Z Boat","Blue",1,1.5,6,1,1,0,1,0,0,110,"Rick","None,None,None",4,620.98765432098764,"Philip Pace",620.98765432098764]
["John Jones","Z Boat","Blue",1,1.5,11,1,3,0,1,0,0,220,"Rick","None,None,None",4,620.98765432098764,"John Jones",620.98765432098764]
["Rick Whitsell","Jamaica","Red",2,2.5,8,1,3,0,1,0,0,190,"John","None,None,None",6,917.90055248618785,"Rick Whitsell",917.90055248618785]
["Matt Larson","Nagato","Blue",6,6,12,1,15,0,1,0,0,590,"Matt M","None,None,None",10,1552.4691358024691,"Matt Larson",1552.4691358024691]

{"sheet":"Nats Thurs Campaign","index":10,"n_rows":37,"n_cols":43,"rows_kept":37,"cut":false,"hidden":false,"merged":[]}
[null,null,null,null,null,null,null,null,"Winner:",{"$f":"IF(K2>K3, B2, IF(K3>K2, B3, \"Tie\"))","v":"Red"},null,null,"Battle Location and Month (i.e. MD May)","Nats",null,"Convoy Runs",null,null,null,null,null,null,"Sinks",null,null,null,null,null,"Convoy Friendly Ram",null,null,null,null,null,null,"Ram Penalties"]
["Fleet 1 :","Red",null,null,null,"Fleet Points:",{"$f":"B15","v":75800},"Fleet Penalties:",{"$f":"B16","v":0},"Fleet Score:",{"$f":"B17","v":75800},null,"Battle Day","Thurs",null,"Captain","Fleet","Ship","Ship Length","Number of Runs","Points",null,"Captain","Fleet","Ship","Class","Sink Points",null,"Ramming Captain","Fleet","Convoy Ship","Convoy Captain","Ship Length","Points",null,"Ramming Captain","Fleet","Ram Type","Rammed Captain","Rammed Ship","Rammed Ship Class","Ram Sink","Points"]
["Fleet 2 :","Blue",null,null,null,"Fleet Points:",{"$f":"C15","v":68150},"Fleet Penalties:",{"$f":"C16","v":0},"Fleet Score:",{"$f":"C17","v":68150},null,null,null,null,"William Tustin","Red","wasp",60,10,8500,null,"Bob Hoernemann","Blue","Glorie",2,600]
[null,null,null,null,null,null,null,null,null,null,null,null,null,null,null,"Craig Singer","Red","Algol",36.75,4,2200,null,"Brian Koehler","Blue","Glorie",2,600]
["Fleet:",{"$f":"B2","v":"Red"},{"$f":"B3","v":"Blue"},null,null,null,null,null,null,null,null,null,null,null,null,"Craig Singer","Red","C3",42,7,3850,null,"Carl Bitondo","Blue","Z Boat",1,400]
["Targets Remaining:",0,0,null,null,null,null,null,null,null,null,null,null,null,null,"Rob Arena","Red","Frieghter",51,11,6050,null,"Kas Gaigalas","Red","Washington",6,1000]
["Target Points:",0,0,null,null,null,null,null,null,null,null,null,null,null,null,"Nate Graham","Red","Freighter",51,8,4400]
["Convoy Run Points:",73200,67150,null,null,null,null,null,null,null,null,null,null,null,null,"Nate Graham","Red","Algol",38,4,2200]
["Scuttled Convoy Points:",0,0,null,null,null,null,null,null,null,null,null,null,null,null,"Tom Palmer","Red","Saratoga",74,11,9350]
["Sink Points:",1600,1000,null,null,null,null,null,null,null,null,null,null,null,null,"Matt Andrews","Red","Altmark",48,10,5500]
["Convoy Friendly Ram Points:",null,null,null,null,null,null,null,null,null,null,null,null,null,null,"Carl Camurati","Red","C3",37,11,6050]
["Ram Penalty Points:",null,null,null,null,null,null,null,null,null,null,null,null,null,null,"Timothy Beckett","Red","Shinano",70,11,9350]
["No Ship on Water Points:",1000,0,null,null,null,null,null,null,null,null,null,null,null,null,"Ken Arena","Red","C3",42,8,4400]
["Convoy Run Every 10 Min Points:",0,0,null,null,null,null,null,null,null,null,null,null,null,null,"John Zaruba","Red","Trash Can",40,3,1650]
["Total Points:",{"$f":"B7+B8+B9+B10+B11+B13+B14","v":75800},{"$f":"C7+C8+C9+C10+C11+C13+C14","v":68150},null,null,null,null,null,null,null,null,null,null,null,null,"Lou Meszaros","Red","Freighter",42,11,6050]
["Total Penalties:",{"$f":"B12","v":0},{"$f":"C12","v":0},null,null,null,null,null,null,null,null,null,null,null,null,"Chris Pearce","Red","C3",38,2,1100]
["Fleet Score:",{"$f":"B15-B16","v":75800},{"$f":"C15-C16","v":68150},null,null,null,null,null,null,null,null,null,null,null,null,"Chris Pearce","Red","LST",27,3,900]
[null,null,null,null,null,null,null,null,null,null,null,null,null,null,null,"Kas Gaigalas","Red","Liberty",38,3,1650]
[null,null,null,null,null,null,null,null,null,null,null,null,null,null,null,"Justin Ragucci","Blue","Hospital",42,5,2750]
[null,null,null,null,null,null,null,null,null,null,null,null,null,null,null,"Justin Ragucci","Blue","Seaplane",50,5,2750]
[null,null,null,null,null,null,null,null,null,null,null,null,null,null,null,"Tom Tanner","Blue","Oki Maru",37,9,4950]
[null,null,null,null,null,null,null,null,null,null,null,null,null,null,null,"Alex Hampton","Blue","Nippon",37,11,6050]
[null,null,null,null,null,null,null,null,null,null,null,null,null,null,null,"Matt Larson","Blue","Riyho",52,8,4400]
[null,null,null,null,null,null,null,null,null,null,null,null,null,null,null,"John Jones","Blue","Oruku",40,7,3850]
[null,null,null,null,null,null,null,null,null,null,null,null,null,null,null,"Philip Pace","Blue","Jap Supply",40,7,3850]
[null,null,null,null,null,null,null,null,null,null,null,null,null,null,null,"Peter Ellison","Blue","Freighter",43,6,3300]
[null,null,null,null,null,null,null,null,null,null,null,null,null,null,null,"Peter Ellison","Blue","LST",27,1,300]
[null,null,null,null,null,null,null,null,null,null,null,null,null,null,null,"Zach Hoernemann","Blue","LST",27,6,1800]
[null,null,null,null,null,null,null,null,null,null,null,null,null,null,null,"Bob Hoernemann","Blue","LST",27,6,1800]
[null,null,null,null,null,null,null,null,null,null,null,null,null,null,null,"Michael Smith","Blue","Rioju",50,8,4400]
[null,null,null,null,null,null,null,null,null,null,null,null,null,null,null,"Andy Terpstra","Blue","Frieghter",43,5,2750]
[null,null,null,null,null,null,null,null,null,null,null,null,null,null,null,"Gerald Roberts","Blue","Hiyu",60,3,2550]
[null,null,null,null,null,null,null,null,null,null,null,null,null,null,null,"Eric Bitondo","Blue","Akohu",40,4,2200]
[null,null,null,null,null,null,null,null,null,null,null,null,null,null,null,"McCoy Helland","Blue","Mykawa",40,7,3850]
[null,null,null,null,null,null,null,null,null,null,null,null,null,null,null,"Tyler Helland","Blue","Akahu",40,8,4400]
[null,null,null,null,null,null,null,null,null,null,null,null,null,null,null,"Jeff Lide","Blue","Shinano",70,8,6800]
[null,null,null,null,null,null,null,null,null,null,null,null,null,null,null,"Mark Lide","Blue","Akashi",40,8,4400]

{"sheet":"Nats Steve v Justin 1","index":11,"n_rows":6,"n_cols":20,"rows_kept":6,"cut":false,"hidden":false,"merged":[]}
[null,null,null,null,null,null,null,null,"Winner:",{"$f":"IF(K2>K3, B2, IF(K3>K2, B3, \"Tie\"))","v":"Steve"},null,"Battle Type","Battle Location and Month (i.e. MD May)","Nats",null,null,null,null,"Fleet"]
["Fleet 1 :","Steve",null,"Fleet Units:",5,"Fleet Weight:",9,"Fleet Battle Damage:",1620,"Fleet Score:",1680,null,"Battle Day","Steve v Justin",null,null,null,null,"Mini-Fleet"]
["Fleet 2 :","Justin",null,"Fleet Units:",5.5,"Fleet Weight:",9,"Fleet Battle Damage:",1680,"Fleet Score:",1620,null,"Battle Number",1,null,null,null,null,"Individual"]
["Captian","Ship","Fleet","Class","Units","Above","On","Below","Sinks","Participate all Sorties","Penalties Points","2nd Sortie Sink","Damage Points","Scored By","Notes","Weight Factor","Weight Points","Captian","Captain Points","Indiv Points"]
["Steve Andrews","Iron Duke","Steve",5,5,47,11,31,0,1,0,0,1620,"Justin","None,None,None",9,1680,"Steve Andrews",1680,60]
["Justin Ragucci","Rivadavia","Justin",5,5.5,69,9,27,0,1,0,0,1680,"Steve","None,None,None",9,1620,"Justin Ragucci",1620,0]

{"sheet":"Nats Matt v Justin 1","index":12,"n_rows":6,"n_cols":20,"rows_kept":6,"cut":false,"hidden":false,"merged":[]}
[null,null,null,null,null,null,null,null,"Winner:",{"$f":"IF(K2>K3, B2, IF(K3>K2, B3, \"Tie\"))","v":"Justin"},null,"Battle Type","Battle Location and Month (i.e. MD May)","Nats",null,null,null,null,"Fleet"]
["Fleet 1 :","Matt",null,"Fleet Units:",5,"Fleet Weight:",9,"Fleet Battle Damage:",1170,"Fleet Score:",530,null,"Battle Day","Matt v Justin",null,null,null,null,"Mini-Fleet"]
["Fleet 2 :","Justin",null,"Fleet Units:",5.5,"Fleet Weight:",9,"Fleet Battle Damage:",530,"Fleet Score:",1170,null,"Battle Number",1,null,null,null,null,"Individual"]
["Captian","Ship","Fleet","Class","Units","Above","On","Below","Sinks","Participate all Sorties","Penalties Points","2nd Sortie Sink","Damage Points","Scored By","Notes","Weight Factor","Weight Points","Captian","Captain Points","Indiv Points"]
["Matt Andrews","Iron Duke","Matt",5,5,49,1,22,0,1,0,0,1170,"Justin","None,None,None",9,530,"Matt Andrews",530,0]
["Justin Ragucci","Rivadavia","Justin",5,5.5,15,1,12,0,1,0,0,530,"Matt","None,None,None",9,1170,"Justin Ragucci",1170,640]

{"sheet":"Nats Matt v Caleb 1","index":13,"n_rows":6,"n_cols":20,"rows_kept":6,"cut":false,"hidden":false,"merged":[]}
[null,null,null,null,null,null,null,null,"Winner:",{"$f":"IF(K2>K3, B2, IF(K3>K2, B3, \"Tie\"))","v":"Caleb"},null,"Battle Type","Battle Location and Month (i.e. MD May)","Nats",null,null,null,null,"Fleet"]
["Fleet 1 :","Matt",null,"Fleet Units:",5,"Fleet Weight:",9,"Fleet Battle Damage:",2750,"Fleet Score:",1990,null,"Battle Day","Matt v Caleb",null,null,null,null,"Mini-Fleet"]
["Fleet 2 :","Caleb",null,"Fleet Units:",4.5,"Fleet Weight:",8,"Fleet Battle Damage:",1990,"Fleet Score:",2750,null,"Battle Number",1,null,null,null,null,"Individual"]
["Captian","Ship","Fleet","Class","Units","Above","On","Below","Sinks","Participate all Sorties","Penalties Points","2nd Sortie Sink","Damage Points","Scored By","Notes","Weight Factor","Weight Points","Captian","Captain Points","Indiv Points"]
["Caleb Smith","Courbet","Caleb",4,4.5,43,5,22,1,1,0,1,1990,"Matt","None,None,None",8,2750,"Caleb Smith",2550,760]
["Matt Andrews","Iron Duke","Matt",5,5,55,14,34,1,1,0,1,2750,"Caleb","None,None,None",9,1990,"Matt Andrews",1790,0]

{"sheet":"Nats Cruiser 2","index":14,"n_rows":25,"n_cols":20,"rows_kept":25,"cut":false,"hidden":false,"merged":[]}
[null,null,null,null,null,null,null,null,"Winner:",{"$f":"IF(K2>K3, B2, IF(K3>K2, B3, \"Tie\"))","v":"No Flag"},null,"Battle Type","Battle Location and Month (i.e. MD May)","Nats",null,null,null,null,"Fleet"]
["Fleet 1 :","Flag",null,"Fleet Units:",27.5,"Fleet Weight:",61,"Fleet Battle Damage:",9710,"Fleet Score:",5590,null,"Battle Day","Cruiser",null,null,null,null,"Mini-Fleet"]
["Fleet 2 :","No Flag",null,"Fleet Units:",33,"Fleet Weight:",68,"Fleet Battle Damage:",5590,"Fleet Score:",9709.9990234375,null,"Battle Number",2,null,null,null,null,"Individual"]
["Captian","Ship","Fleet","Class","Units","Above","On","Below","Sinks","Participate all Sorties","Penalties Points","2nd Sortie Sink","Damage Points","Scored By","Notes","Weight Factor","Weight Points","Captian","Captain Points","Indiv Points"]
["Eric Bitondo","Deutschland","Flag",3,3.5,88,6,11,1,1,0,1,2030,"Eric","None,None,None",7,641.47540983606564,"Eric Bitondo",441.47540983606564,0]
["Carl Bitondo","Deutschland","Flag",3,3.5,74,5,9,2,1,0,1,2510,"Carl","None,None,None",7,641.47540983606564,"Carl Bitondo",441.47540983606564,0]
["Kevin Plumer","Radetzky","Flag",3,3.5,30,17,33,0,1,0,0,1630,"Tom T","None,None,None",7,641.47540983606564,"Kevin Plumer",641.47540983606564,0]
["Peter Ellison","Erin","No Flag",4,4.5,40,0,1,0,1,0,0,430,"Peter","None,None,None",8,1142.3529411764705,"Peter Ellison",1142.3529411764705,484.7057674632353]
["John Jones","Z Boat","Flag",1,1.5,20,1,0,0,1,0,0,220,"John ","None,None,None",4,366.55737704918033,"John Jones",366.55737704918033,0]
["Kas Gaigalas","Glorie","Flag",2,2.5,8,4,3,1,1,0,1,850,"Craig","None,None,None",6,549.8360655737705,"Kas Gaigalas",349.8360655737705,0]
["Craig Singer","Jamaica","No Flag",2,2.5,15,5,3,1,0,0,0,940,"Kas","None,None,None",3,428.38235294117652,"Craig Singer",428.38235294117652,181.76466279871326]
["Michael Smith","Glorie","No Flag",2,2.5,11,2,4,0,1,0,0,270,"Matt M","None,None,None",6,856.76470588235304,"Michael Smith",856.76470588235304,363.52932559742652]
["Cameron Hunt","Deutschland","Flag",3,3.5,21,6,3,0,1,0,0,420,"Ron","None,None,None",7,641.47540983606564,"Cameron Hunt",641.47540983606564,0]
["Bob Hoernemann","Radetzky","No Flag",3,3.5,24,6,15,0,1,0,0,810,"Tyler","None,None,None",7,999.55882352941171,"Bob Hoernemann",999.55882352941171,424.11754653033086]
["Zach Hoernemann","Radetzky","No Flag",3,3.5,7,1,6,0,1,0,0,270,"Tyler","None,None,None",7,999.55882352941171,"Zach Hoernemann",999.55882352941171,424.11754653033086]
["Andy Terpstra","Glorie","No Flag",2,2.5,5,5,1,1,1,0,1,780,"Andy","None,None,None",6,856.76470588235304,"Andy Terpstra",656.76470588235304,363.52932559742652]
["Steve Andrews","Suffren","No Flag",3,3,55,6,3,0,1,0,0,760,"Kevin","None,None,None",7,999.55882352941171,"Steve Andrews",999.55882352941171,424.11754653033086]
["Caleb Smith","Z Boat","Flag",1,1.5,28,1,7,0,1,0,0,510,"Matt","None,None,None",4,366.55737704918033,"Caleb Smith",366.55737704918033,0]
["Philip Pace","Z Boat","No Flag",1,1.5,1,0,0,0,1,0,0,10,"John","None,None,None",4,571.17647058823525,"Philip Pace",571.17647058823525,242.35288373161765]
["Matt Mullis","Prinz Eugen","No Flag",3,3.5,7,0,4,0,1,0,0,190,"John Z","None,None,None",7,999.55882352941171,"Matt Mullis",999.55882352941171,424.11754653033086]
["John Zaruba","Glorie","Flag",2,2.5,26,4,3,1,1,0,1,1030,"John ","None,None,None",6,549.8360655737705,"John Zaruba",349.8360655737705,0]
["Tom Tanner","Deutschland","No Flag",3,3.5,29,5,15,0,1,0,0,840,"Kevin","None,None,None",7,999.55882352941171,"Tom Tanner",999.55882352941171,424.11754653033086]
["Tyler Helland","Glorie","Flag",2,2.5,22,4,2,0,1,0,0,360,"Andy","None,None,None",6,549.8360655737705,"Tyler Helland",549.8360655737705,0]
["McCoy Helland","Zara","Flag",3,3,3,3,2,0,1,0,0,150,"Andy","None,None,None",7,641.47540983606564,"McCoy Helland",641.47540983606564,0]
["Matt Larson","Glorie","No Flag",2,2.5,13,2,4,0,1,0,0,290,"Mike S","None,None,None",6,856.76470588235304,"Matt Larson",856.76470588235304,363.52932559742652]

{"sheet":"Nats Cruiser 1","index":15,"n_rows":25,"n_cols":20,"rows_kept":25,"cut":false,"hidden":false,"merged":[]}
[null,null,null,null,null,null,null,null,"Winner:",{"$f":"IF(K2>K3, B2, IF(K3>K2, B3, \"Tie\"))","v":"Flag"},null,"Battle Type","Battle Location and Month (i.e. MD May)","Nats",null,null,null,null,"Fleet"]
["Fleet 1 :","Flag",null,"Fleet Units:",31,"Fleet Weight:",65,"Fleet Battle Damage:",4100,"Fleet Score:",8810,null,"Battle Day","Cruiser",null,null,null,null,"Mini-Fleet"]
["Fleet 2 :","No Flag",null,"Fleet Units:",30.5,"Fleet Weight:",61.5,"Fleet Battle Damage:",8810,"Fleet Score:",3400,null,"Battle Number",1,null,null,null,null,"Individual"]
["Captian","Ship","Fleet","Class","Units","Above","On","Below","Sinks","Participate all Sorties","Penalties Points","2nd Sortie Sink","Damage Points","Scored By","Notes","Weight Factor","Weight Points","Captian","Captain Points","Indiv Points"]
["Peter Ellison","Erin","No Flag",4,4.5,113,7,6,1,1,0,1,2250,"Kevin","None,None,None",8,533.33333333333337,"Peter Ellison",333.33333333333337,0]
["Kevin Plumer","Radetzky","Flag",3,3.5,33,14,2,0,1,0,0,670,"Peter","None,None,None",7,948.76923076923083,"Kevin Plumer",948.76923076923083,582.61538461538464]
["Matt Mullis","Prinz Eugen","No Flag",3,3.5,5,0,1,0,0,700,0,80,"John Z","Withdraw,None,None",3.5,-466.66666666666669,"Matt Mullis",-466.66666666666669,0]
["Philip Pace","Z Boat","No Flag",1,1.5,12,1,1,1,1,0,1,570,"Phil","None,None,None",4,266.66666666666669,"Philip Pace",66.666666666666686,0]
["John Jones","Z Boat","Flag",1,1.5,1,3,4,0,1,0,0,190,"Phil","None,None,None",4,542.15384615384619,"John Jones",542.15384615384619,332.92307692307696]
["Tyler Helland","Glorie","Flag",2,2.5,15,0,0,0,1,0,0,150,"Andy","None,None,None",6,813.23076923076928,"Tyler Helland",813.23076923076928,499.38461538461542]
["McCoy Helland","Zara","Flag",3,3,8,1,0,0,1,0,0,100,"Zach","None,None,None",7,948.76923076923083,"McCoy Helland",948.76923076923083,582.61538461538464]
["Steve Andrews","Suffren","No Flag",3,3,29,5,10,0,1,0,0,690,"Tom","None,None,None",7,466.66666666666663,"Steve Andrews",466.66666666666663,0]
["Lee McKinzie","Radetzky","No Flag",3,3.5,24,16,12,1,1,0,1,1620,"Lee","None,None,None",7,466.66666666666663,"Lee McKinzie",266.66666666666663,0]
["Caleb Smith","Z Boat","Flag",1,1.5,27,0,5,0,1,0,0,420,"Nate","None,None,None",4,542.15384615384619,"Caleb Smith",542.15384615384619,332.92307692307696]
["Tom Tanner","Deutschland","Flag",3,3.5,3,1,2,0,1,0,0,110,"Matt","None,None,None",7,948.76923076923083,"Tom Tanner",948.76923076923083,582.61538461538464]
["Bob Hoernemann","Radetzky","No Flag",3,3.5,22,3,5,0,1,0,0,430,"Caleb","None,None,None",7,466.66666666666663,"Bob Hoernemann",466.66666666666663,0]
["Craig Singer","Jamaica","No Flag",2,2.5,6,2,1,0,1,0,0,130,"Caleb","None,None,None",6,400,"Craig Singer",400,0]
["Andy Terpstra","Glorie","No Flag",2,2.5,5,1,1,2,1,0,1,1300,"Tyler","None,None,None",6,400,"Andy Terpstra",200,0]
["Kas Gaigalas","Glorie","Flag",2,2.5,1,1,2,0,1,0,0,90,"Craig","None,None,None",6,813.23076923076928,"Kas Gaigalas",813.23076923076928,499.38461538461542]
["Eric Bitondo","Deutschland","Flag",3,3.5,30,3,5,0,1,0,0,510,"Eric","None,None,None",7,948.76923076923083,"Eric Bitondo",948.76923076923083,582.61538461538464]
["Carl Bitondo","Deutschland","Flag",3,3.5,40,2,4,0,1,0,0,560,"Carl","None,None,None",7,948.76923076923083,"Carl Bitondo",948.76923076923083,582.61538461538464]
["John Zaruba","Glorie","Flag",2,2.5,13,3,3,1,0,0,0,880,"Matt M","None,None,None",3,406.61538461538464,"John Zaruba",406.61538461538464,249.69230769230771]
["Matt Larson","Glorie","No Flag",2,2.5,12,1,13,0,1,0,0,530,"Mike S","None,None,None",6,400,"Matt Larson",400,0]
["Cameron Hunt","Deutschland","Flag",3,3.5,23,5,3,0,1,0,0,420,"Matt L","None,None,None",7,948.76923076923083,"Cameron Hunt",948.76923076923083,582.61538461538464]
["Zach Hoernemann","Radetzky","No Flag",3,3.5,34,1,5,1,1,0,1,1210,"Zach","None,None,None",7,466.66666666666663,"Zach Hoernemann",266.66666666666663,0]

{"sheet":"Nats Thurs 1","index":16,"n_rows":47,"n_cols":20,"rows_kept":47,"cut":false,"hidden":false,"merged":[]}
[null,null,null,null,null,null,null,null,"Winner:",{"$f":"IF(K2>K3, B2, IF(K3>K2, B3, \"Tie\"))","v":"Red"},null,"Battle Type","Battle Location and Month (i.e. MD May)","Nats",null,null,null,null,"Fleet"]
["Fleet 1 :","Red",null,"Fleet Units:",108,"Fleet Weight:",181,"Fleet Battle Damage:",28490,"Fleet Score:",29309.994140625,null,"Battle Day","Thurs",null,null,null,null,"Mini-Fleet"]
["Fleet 2 :","Blue",null,"Fleet Units:",99,"Fleet Weight:",168,"Fleet Battle Damage:",29310,"Fleet Score:",27440.001953125,null,"Battle Number",1,null,null,null,null,"Individual"]
["Captian","Ship","Fleet","Class","Units","Above","On","Below","Sinks","Participate all Sorties","Penalties Points","2nd Sortie Sink","Damage Points","Scored By","Notes","Weight Factor","Weight Points","Captian","Captain Points","Indiv Points"]
["Robert Stalnaker","Baden","Blue",5,5.5,18,3,9,1,1,0,1,1410,"Kevin","None,None,None",9,1526.25,"Robert Stalnaker",1326.25]
["Ron Hunt","Des Moines","Red",3,3.5,29,14,16,0,1,0,0,1050,"Tom T","None,None,None",7,1133.5359116022098,"Ron Hunt",1133.5359116022098]
["Carl Camurati","Nassau","Red",4,4,36,9,14,0,1,0,0,960,"Tom T","None,None,None",8,1295.4696132596684,"Carl Camurati",1295.4696132596684]
["Nate Graham","West Virginia","Red",5,5.5,46,6,12,0,1,0,0,940,"Tyler","None,None,None",9,1457.4033149171271,"Nate Graham",1457.4033149171271]
["Chris Pearce","Bismark","Red",6,6.5,29,7,26,0,1,0,0,1210,"Andy","None,None,None",10,1619.3370165745855,"Chris Pearce",1619.3370165745855]
["Lee McKinzie","Iron Duke","Red",5,5,77,12,42,1,1,0,1,3170,"Andy","None,None,None",9,1457.4033149171271,"Lee McKinzie",1257.4033149171271]
["Justin Ragucci","Rivadavia","Blue",5,5.5,22,2,14,0,1,0,0,680,"Rob A","None,None,None",9,1526.25,"Justin Ragucci",1526.25]
["Rob Arena","Gearing","Red",1,1.5,3,2,3,0,0,0,0,160,"Carl B","None,None,None",2,323.86740331491711,"Rob Arena",323.86740331491711]
["Lou Meszaros","Courbet","Red",4,4.5,10,2,7,0,1,0,0,350,"Eric B","None,None,None",8,1295.4696132596684,"Lou Meszaros",1295.4696132596684]
["Carl Bitondo","Deutschland","Blue",3,3.5,21,2,8,0,1,0,0,490,"Lou","None,None,None",7,1187.0833333333333,"Carl Bitondo",1187.0833333333333]
["Eric Bitondo","Deutschland","Blue",3,3.5,52,7,8,0,1,0,0,900,"Lou","None,None,None",7,1187.0833333333333,"Eric Bitondo",1187.0833333333333]
["Steve Andrews","Iron Duke","Red",5,5,48,11,25,0,1,0,0,1450,"Alex","None,None,None",9,1457.4033149171271,"Steve Andrews",1457.4033149171271]
["Tom Tanner","Ostfriesland","Blue",4,4.5,11,1,3,0,1,0,0,220,"carl","None,None,None",8,1356.6666666666665,"Tom Tanner",1356.6666666666665]
["Gerald Roberts","Nagato","Blue",6,6,102,33,49,0,1,0,0,3150,"Ron H","None,None,None",10,1695.8333333333333,"Gerald Roberts",1695.8333333333333]
["Kas Gaigalas","Washington","Red",6,6,30,6,9,0,1,0,0,690,"Justin","None,None,None",10,1619.3370165745855,"Kas Gaigalas",1619.3370165745855]
["Rob Arena","Arizona","Red",5,5.5,5,4,19,1,0,0,0,1600,"Justin","None,None,None",4.5,728.70165745856355,"Rob Arena",728.70165745856355]
["Kevin Plumer","Scharnhorst","Red",5,5.5,21,1,30,0,1,0,0,1130,"Justin","None,None,None",9,1457.4033149171271,"Kevin Plumer",1457.4033149171271]
["Brian Lamb","Deutschland","Red",3,3.5,2,0,2,0,1,0,0,80,"Peter","None,None,None",7,1133.5359116022098,"Brian Lamb",1133.5359116022098]
["William Tustin","Iron Duke","Red",5,5,37,7,24,0,1,0,0,1230,"Alex","None,None,None",9,1457.4033149171271,"William Tustin",1457.4033149171271]
["Matt Andrews","Iron Duke","Red",5,5,38,6,18,0,1,0,0,1040,"Tyler","None,None,None",9,1457.4033149171271,"Matt Andrews",1457.4033149171271]
["Caleb Smith","Courbet","Red",4,4.5,48,3,31,1,1,0,1,2270,"Justin","None,None,None",8,1295.4696132596684,"Caleb Smith",1095.4696132596684]
["John Zaruba","Andra Doria","Red",4,4.5,110,8,42,0,1,0,0,2520,"Matt L","None,None,None",8,1295.4696132596684,"John Zaruba",1295.4696132596684]
["Jeff Lide","Yamato","Blue",7,8,164,22,50,0,1,0,0,3580,"Matt A","None,None,None",10,1695.8333333333333,"Jeff Lide",1695.8333333333333]
["Tyler Helland","Yamato","Blue",7,8,214,39,67,1,1,0,1,6130,"Chris","None,None,None",10,1695.8333333333333,"Tyler Helland",1495.8333333333333]
["Alex Hampton","Dreadnough","Blue",4,4,76,3,7,0,1,0,0,1030,"Will ","None,None,None",8,1356.6666666666665,"Alex Hampton",1356.6666666666665]
["Craig Singer","Bismark","Red",6,6.5,69,28,55,1,1,0,1,3900,"Mark","None,None,None",10,1619.3370165745855,"Craig Singer",1419.3370165745855]
["Mark Lide","Nagato","Blue",6,6,83,10,21,0,1,0,0,1660,"Craig","None,None,None",10,1695.8333333333333,"Mark Lide",1695.8333333333333]
["Matt Larson","Nagato","Blue",6,6,62,3,2,0,1,0,0,740,"John Z","None,None,None",10,1695.8333333333333,"Matt Larson",1695.8333333333333]
["Bob Hoernemann","Nagato","Blue",6,6,77,4,46,0,1,50,0,2230,"Kevin","Ram Superstructure,None,None",10,1645.8333333333333,"Bob Hoernemann",1645.8333333333333]
["Philip Pace","Z Boat","Blue",1,1.5,2,0,2,0,1,0,0,80,"Rick","None,None,None",4,678.33333333333326,"Philip Pace",678.33333333333326]
["Rick Whitsell","Jamaica","Red",2,2.5,11,2,2,0,1,0,0,210,"Phil","None,None,None",6,971.60220994475139,"Rick Whitsell",971.60220994475139]
["John Jones","Z Boat","Blue",1,1.5,6,0,0,0,1,0,0,60,"Rick","None,None,None",4,678.33333333333326,"John Jones",678.33333333333326]
["Zach Hoernemann","Nagato","Blue",6,6,63,3,14,0,1,100,0,1110,"Lee","Ram Above,None,None",10,1595.8333333333333,"Zach Hoernemann",1595.8333333333333]
["Ken Arena","Iron Duke","Red",5,5,10,5,17,1,1,0,1,1610,"Brian K","None,None,None",9,1457.4033149171271,"Ken Arena",1257.4033149171271]
["Brian Koehler","QE","Blue",5,5.5,91,10,20,0,1,0,0,1710,"Ken","None,None,None",9,1526.25,"Brian Koehler",1526.25]
["Timothy Beckett","Bismark","Red",6,6.5,27,8,34,0,1,0,0,1450,"Gerald","None,None,None",10,1619.3370165745855,"Timothy Beckett",1619.3370165745855]
["Matt Mullis","Prinz Eugen","Red",3,3.5,2,0,0,0,1,0,0,20,"Matt L","None,None,None",7,1133.5359116022098,"Matt Mullis",1133.5359116022098]
["Peter Ellison","Erin","Blue",4,4.5,93,4,6,1,1,0,1,1990,"Tom P","None,None,None",8,1356.6666666666665,"Peter Ellison",1156.6666666666665]
["Michael Smith","Seydlitz","Blue",4,4.5,22,2,5,0,1,900,0,410,"John Z","Ram Sink Will,None,None",8,456.66666666666652,"Michael Smith",456.66666666666652]
["Tom Palmer","QE","Red",5,5.5,24,3,7,0,1,0,0,510,"Peter","None,None,None",9,1457.4033149171271,"Tom Palmer",1457.4033149171271]
["Andy Terpstra","Nagato","Blue",6,6,38,8,37,0,1,0,0,1650,"Tim B","None,None,None",10,1695.8333333333333,"Andy Terpstra",1695.8333333333333]
["Cameron Hunt","Deutschland","Red",3,3.5,9,3,3,1,0,0,0,940,"Gerald","None,None,None",3.5,566.7679558011049,"Cameron Hunt",566.7679558011049]
["McCoy Helland","Zara","Blue",3,3,2,0,2,0,1,0,0,80,"Cameron","None,None,None",7,1187.0833333333333,"McCoy Helland",1187.0833333333333]

{"sheet":"Nats Wed 1","index":17,"n_rows":15,"n_cols":20,"rows_kept":15,"cut":false,"hidden":false,"merged":[]}
[null,null,null,null,null,null,null,null,"Winner:",{"$f":"IF(K2>K3, B2, IF(K3>K2, B3, \"Tie\"))","v":"Red"},null,"Battle Type","Battle Location and Month (i.e. MD May)","Nats",null,null,null,null,"Fleet"]
["Fleet 1 :","Red",null,"Fleet Units:",39,"Fleet Weight:",68,"Fleet Battle Damage:",1690,"Fleet Score:",3990,null,"Battle Day","Wed",null,null,null,null,"Mini-Fleet"]
["Fleet 2 :","Blue",null,"Fleet Units:",12.5,"Fleet Weight:",23,"Fleet Battle Damage:",3990,"Fleet Score:",1690,null,"Battle Number",1,null,null,null,null,"Individual"]
["Captian","Ship","Fleet","Class","Units","Above","On","Below","Sinks","Participate all Sorties","Penalties Points","2nd Sortie Sink","Damage Points","Scored By","Notes","Weight Factor","Weight Points","Captian","Captain Points","Indiv Points"]
["Steve Andrews","Iron Duke","Red",5,5,0,0,2,0,1,0,0,60,"Justin","None,None,None",9,528.08823529411768,"Steve Andrews",528.08823529411768]
["Caleb Smith","Courbet","Red",4,4.5,8,1,2,0,1,0,0,160,"Justin","None,None,None",8,469.41176470588232,"Caleb Smith",469.41176470588232]
["Kevin Plumer","Scharnhorst","Red",5,5.5,4,0,3,0,1,0,0,130,"Justin","None,None,None",9,528.08823529411768,"Kevin Plumer",528.08823529411768]
["Rick Whitsell","Jamaica","Red",2,2.5,1,0,0,0,1,0,0,10,"Tom T","None,None,None",6,352.05882352941177,"Rick Whitsell",352.05882352941177]
["Tom Palmer","QE","Red",5,5.5,10,1,1,0,1,0,0,150,"Tom T","None,None,None",9,528.08823529411768,"Tom Palmer",528.08823529411768]
["Chris Pearce","Bismark","Red",6,6.5,18,9,14,0,1,0,0,780,"Tom","None,None,None",10,586.76470588235293,"Chris Pearce",586.76470588235293]
["Matt Mullis","Prinz Eugen","Blue",3,3.5,0,0,3,0,1,0,0,90,"Kevin P","None,None,None",7,514.3478260869565,"Matt Mullis",514.3478260869565]
["John Zaruba","Andra Doria","Blue",4,4.5,47,6,15,0,1,0,0,1040,"Kevin ","None,None,None",8,587.82608695652175,"John Zaruba",587.82608695652175]
["Tom Tanner","Ostfriesland","Blue",4,4.5,98,12,28,1,1,0,1,2860,"Kevin","None,None,None",8,587.82608695652175,"Tom Tanner",387.82608695652175]
["Ron Hunt","Deutschland","Red",3,3.5,19,1,1,0,1,0,0,240,"Tom ","None,None,None",7,410.73529411764702,"Ron Hunt",410.73529411764702]
["Kas Gaigalas","Washington","Red",6,6,10,0,2,0,1,0,0,160,"Tom ","None,None,None",10,586.76470588235293,"Kas Gaigalas",586.76470588235293]

{"sheet":"Nats Tues Campaign","index":18,"n_rows":35,"n_cols":43,"rows_kept":35,"cut":false,"hidden":false,"merged":[]}
[null,null,null,null,null,null,null,null,"Winner:",{"$f":"IF(K2>K3, B2, IF(K3>K2, B3, \"Tie\"))","v":"Blue"},null,null,"Battle Location and Month (i.e. MD May)","Nats",null,"Convoy Runs",null,null,null,null,null,null,"Sinks",null,null,null,null,null,"Convoy Friendly Ram",null,null,null,null,null,null,"Ram Penalties"]
["Fleet 1 :","Red",null,null,null,"Fleet Points:",{"$f":"B15","v":73575},"Fleet Penalties:",{"$f":"B16","v":200},"Fleet Score:",{"$f":"B17","v":73375},null,"Battle Day","Tues",null,"Captain","Fleet","Ship","Ship Length","Number of Runs","Points",null,"Captain","Fleet","Ship","Class","Sink Points",null,"Ramming Captain","Fleet","Convoy Ship","Convoy Captain","Ship Length","Points",null,"Ramming Captain","Fleet","Ram Type","Rammed Captain","Rammed Ship","Rammed Ship Class","Ram Sink","Points"]
["Fleet 2 :","Blue",null,null,null,"Fleet Points:",{"$f":"C15","v":88550},"Fleet Penalties:",{"$f":"C16","v":0},"Fleet Score:",{"$f":"C17","v":88550},null,null,null,null,"Cameron Hunt","Red","C3",41,10,5500,null,null,null,null,null,null,null,null,null,null,null,null,null,null,"Rob Arena","Red","Below","Kevin Plumer","Radetzky",3,0,200]
[null,null,null,null,null,null,null,null,null,null,null,null,null,null,null,"Timothy Beckett","Red","Shinano",70,11,9350]
["Fleet:",{"$f":"B2","v":"Red"},{"$f":"B3","v":"Blue"},null,null,null,null,null,null,null,null,null,null,null,null,"Ken Arena","Red","Wasp",60,11,9350]
["Targets Remaining:",3,0,null,null,null,null,null,null,null,null,null,null,null,null,"Nate Graham","Red","Transport",48,11,6050]
["Target Points:",375,0,null,null,null,null,null,null,null,null,null,null,null,null,"William Tustin","Red","C3",42,9,4950]
["Convoy Run Points:",72200,88550,null,null,null,null,null,null,null,null,null,null,null,null,"Craig Singer","Red","C3",42,12,6600]
["Scuttled Convoy Points:",0,0,null,null,null,null,null,null,null,null,null,null,null,null,"Rob Arena","Red","Algol",38,2,1100]
["Sink Points:",null,null,null,null,null,null,null,null,null,null,null,null,null,null,"Caleb Smith","Red","LST",27,6,1800]
["Convoy Friendly Ram Points:",null,null,null,null,null,null,null,null,null,null,null,null,null,null,"Chris Pearce","Red","Frieghter",51,9,4950]
["Ram Penalty Points:",200,null,null,null,null,null,null,null,null,null,null,null,null,null,"Carl Camurati","Red","Liberty",37,11,6050]
["No Ship on Water Points:",1000,0,null,null,null,null,null,null,null,null,null,null,null,null,"Matt Andrews","Red","C3",38,5,2750]
["Convoy Run Every 10 Min Points:",0,0,null,null,null,null,null,null,null,null,null,null,null,null,"Lou Meszaros","Red","Frieghter",51,8,4400]
["Total Points:",{"$f":"B7+B8+B9+B10+B11+B13+B14","v":73575},{"$f":"C7+C8+C9+C10+C11+C13+C14","v":88550},null,null,null,null,null,null,null,null,null,null,null,null,"Tom Palmer","Red","Saratoga",74,11,9350]
["Total Penalties:",{"$f":"B12","v":200},{"$f":"C12","v":0},null,null,null,null,null,null,null,null,null,null,null,null,"Bob Hoernemann","Blue","LST",28,9,2700]
["Fleet Score:",{"$f":"B15-B16","v":73375},{"$f":"C15-C16","v":88550},null,null,null,null,null,null,null,null,null,null,null,null,"Zach Hoernemann","Blue","LST",28,11,3300]
[null,null,null,null,null,null,null,null,null,null,null,null,null,null,null,"Michael Smith","Blue","Ryuho",51,9,4950]
[null,null,null,null,null,null,null,null,null,null,null,null,null,null,null,"McCoy Helland","Blue","Freighter",42,11,6050]
[null,null,null,null,null,null,null,null,null,null,null,null,null,null,null,"Matt Larson","Blue","Ryujo",52,10,5500]
[null,null,null,null,null,null,null,null,null,null,null,null,null,null,null,"Gerald Roberts","Blue","Huyo",60,6,5100]
[null,null,null,null,null,null,null,null,null,null,null,null,null,null,null,"Peter Ellison","Blue","Frieghter",37,4,2200]
[null,null,null,null,null,null,null,null,null,null,null,null,null,null,null,"John Jones","Blue","Refridge",36,10,5500]
[null,null,null,null,null,null,null,null,null,null,null,null,null,null,null,"Philip Pace","Blue","Kagnio",36,9,4950]
[null,null,null,null,null,null,null,null,null,null,null,null,null,null,null,"Andy Terpstra","Blue","Freighter",43,7,3850]
[null,null,null,null,null,null,null,null,null,null,null,null,null,null,null,"Matt Mullis","Blue","Sen Plane",50,7,3850]
[null,null,null,null,null,null,null,null,null,null,null,null,null,null,null,"John Zaruba","Blue","Trash Can",43,9,4950]
[null,null,null,null,null,null,null,null,null,null,null,null,null,null,null,"Tyler Helland","Blue","Frieghter",42,10,5500]
[null,null,null,null,null,null,null,null,null,null,null,null,null,null,null,"Tom Tanner","Blue","Freight",36,8,4400]
[null,null,null,null,null,null,null,null,null,null,null,null,null,null,null,"Mark Lide","Blue","Akashi",44,6,3300]
[null,null,null,null,null,null,null,null,null,null,null,null,null,null,null,"Jeff Lide","Blue","Shinano",70,7,5950]
[null,null,null,null,null,null,null,null,null,null,null,null,null,null,null,"Justin Ragucci","Blue","Hospital",42,10,5500]
[null,null,null,null,null,null,null,null,null,null,null,null,null,null,null,"Alex Hampton","Blue","Nipon",37,11,6050]
[null,null,null,null,null,null,null,null,null,null,null,null,null,null,null,"Ted Buehring","Blue","altmark",49,5,2750]
[null,null,null,null,null,null,null,null,null,null,null,null,null,null,null,"Brian Koehler","Blue","Altmark",49,4,2200]

{"sheet":"Nats Tues 1","index":19,"n_rows":47,"n_cols":20,"rows_kept":47,"cut":false,"hidden":false,"merged":[]}
[null,null,null,null,null,null,null,null,"Winner:",{"$f":"IF(K2>K3, B2, IF(K3>K2, B3, \"Tie\"))","v":"Blue"},null,"Battle Type","Battle Location and Month (i.e. MD May)","Nats",null,null,null,null,"Fleet"]
["Fleet 1 :","Red",null,"Fleet Units:",103,"Fleet Weight:",166.5,"Fleet Battle Damage:",26500,"Fleet Score:",16580,null,"Battle Day","Tues",null,null,null,null,"Mini-Fleet"]
["Fleet 2 :","Blue",null,"Fleet Units:",104,"Fleet Weight:",180,"Fleet Battle Damage:",16580,"Fleet Score:",26300,null,"Battle Number",1,null,null,null,null,"Individual"]
["Captian","Ship","Fleet","Class","Units","Above","On","Below","Sinks","Participate all Sorties","Penalties Points","2nd Sortie Sink","Damage Points","Scored By","Notes","Weight Factor","Weight Points","Captian","Captain Points","Indiv Points"]
["Lee McKinzie","Iron Duke","Red",5,5,53,17,16,1,1,0,1,2250,"Justin","None,None,None",9,896.21621621621625,"Lee McKinzie",696.21621621621625]
["Jeff Lide","Yamato","Blue",7,8,123,16,42,0,1,0,0,2810,"Tim","None,None,None",10,1472.2222222222222,"Jeff Lide",1472.2222222222222]
["Kevin Plumer","Kongo","Red",4,4.5,91,20,36,1,1,0,1,3190,"Matt","None,None,None",8,796.63663663663658,"Kevin Plumer",596.63663663663658]
["Matt Andrews","Iron Duke","Red",5,5,34,6,28,0,1,0,0,1300,"Tom T","None,None,None",9,896.21621621621625,"Matt Andrews",896.21621621621625]
["Tom Tanner","Ostfriesland","Blue",4,4.5,16,4,8,0,1,0,0,480,"carl","None,None,None",8,1177.7777777777778,"Tom Tanner",1177.7777777777778]
["Gerald Roberts","Nagato","Blue",6,6,114,15,22,0,1,0,0,2100,"Rick","None,None,None",10,1472.2222222222222,"Gerald Roberts",1472.2222222222222]
["Robert Stalnaker","Baden","Blue",5,5.5,21,0,3,0,1,0,0,300,"Matt A","None,None,None",9,1325,"Robert Stalnaker",1325]
["Nate Graham","West Virginia","Red",5,5.5,39,2,15,0,1,0,0,880,"John Z","None,None,None",9,896.21621621621625,"Nate Graham",896.21621621621625]
["William Tustin","Iron Duke","Red",5,5,58,16,27,1,1,0,1,2610,"Alex H","None,None,None",9,896.21621621621625,"William Tustin",696.21621621621625]
["Steve Andrews","Iron Duke","Red",5,5,53,8,31,0,1,0,0,1620,"Tyler","None,None,None",9,896.21621621621625,"Steve Andrews",896.21621621621625]
["Chris Pearce","Bismark","Red",6,6.5,40,8,40,0,1,0,0,1760,"Tyler","None,None,None",10,995.79579579579581,"Chris Pearce",995.79579579579581]
["Brian Lamb","NC","Red",6,6,2,1,2,0,1,0,0,100,"Tyler","None,None,None",10,995.79579579579581,"Brian Lamb",995.79579579579581]
["Craig Singer","Bismark","Red",6,6.5,53,17,11,0,1,0,0,1200,"John Z","None,None,None",10,995.79579579579581,"Craig Singer",995.79579579579581]
["Andy Terpstra","Nagato","Blue",6,6,8,7,22,0,1,0,0,880,"Kevin P","None,None,None",10,1472.2222222222222,"Andy Terpstra",1472.2222222222222]
["Carl Bitondo","Deutschland","Blue",3,3.5,12,1,7,0,1,0,0,350,"Kevin","None,None,None",7,1030.5555555555557,"Carl Bitondo",1030.5555555555557]
["Ken Arena","Iron Duke","Red",5,5,20,3,6,0,1,0,0,440,"Eric B","None,None,None",9,896.21621621621625,"Ken Arena",896.21621621621625]
["Carl Camurati","Nassau","Red",4,4,77,14,30,0,1,0,0,1950,"Tom T","None,None,None",8,796.63663663663658,"Carl Camurati",796.63663663663658]
["Ginger Andrews","Des Moines","Red",3,3.5,31,5,15,0,1,0,0,860,"Carl B","None,None,None",7,697.05705705705714,"Ginger Andrews",697.05705705705714]
["Kas Gaigalas","Washington","Red",6,6,34,3,8,0,1,0,0,640,"Zach H","None,None,None",10,995.79579579579581,"Kas Gaigalas",995.79579579579581]
["Tyler Helland","Yamato","Blue",7,8,91,9,24,0,1,0,0,1810,"Tim","None,None,None",10,1472.2222222222222,"Tyler Helland",1472.2222222222222]
["McCoy Helland","Zara","Blue",3,3,1,0,0,0,1,0,0,10,"Tom P","None,None,None",7,1030.5555555555557,"McCoy Helland",1030.5555555555557]
["Timothy Beckett","Bismark","Red",6,6.5,17,4,19,0,1,0,0,820,"Tyler","None,None,None",10,995.79579579579581,"Timothy Beckett",995.79579579579581]
["Tom Palmer","QE","Red",5,5.5,31,0,21,1,0,0,0,1840,"tyler","None,None,None",4.5,448.10810810810813,"Tom Palmer",448.10810810810813]
["Justin Ragucci","Rivadavia","Blue",5,5.5,22,2,17,0,1,0,0,770,"Rob A","None,None,None",9,1325,"Justin Ragucci",1325]
["Lou Meszaros","Courbet","Red",4,4.5,15,3,3,0,1,0,0,300,"Alex","None,None,None",8,796.63663663663658,"Lou Meszaros",796.63663663663658]
["Eric Bitondo","Deutschland","Blue",3,3.5,31,2,8,0,1,0,0,590,"Ginger","None,None,None",7,1030.5555555555557,"Eric Bitondo",1030.5555555555557]
["Alex Hampton","Dreadnough","Blue",4,4,67,7,13,0,1,0,0,1200,"Steve","None,None,None",8,1177.7777777777778,"Alex Hampton",1177.7777777777778]
["Kevin Sundberg","Iron Duke","Red",5,5,54,6,10,1,1,0,1,1860,"Ted","None,None,None",9,896.21621621621625,"Kevin Sundberg",696.21621621621625]
["Zach Hoernemann","Nagato","Blue",6,6,27,0,15,0,1,0,0,720,"Kevin P","None,None,None",10,1472.2222222222222,"Zach Hoernemann",1472.2222222222222]
["Matt Mullis","Prinz Eugen","Blue",3,3.5,5,1,0,0,1,0,0,70,"Craig","None,None,None",7,1030.5555555555557,"Matt Mullis",1030.5555555555557]
["John Zaruba","Andra Doria","Blue",4,4.5,30,1,11,0,1,0,0,650,"Craig","None,None,None",8,1177.7777777777778,"John Zaruba",1177.7777777777778]
["Bob Hoernemann","Nagato","Blue",6,6,29,4,23,0,1,200,0,1060,"Kevin ","Ram below,None,None",10,1272.2222222222222,"Bob Hoernemann",1272.2222222222222]
["Rob Arena","Arizona","Red",5,5.5,41,3,10,0,1,0,0,770,"Justin","None,None,None",9,896.21621621621625,"Rob Arena",896.21621621621625]
["Caleb Smith","Gearing","Red",1,1.5,2,2,3,0,0,0,0,150,"Justin","None,None,None",2,199.15915915915915,"Caleb Smith",199.15915915915915]
["Caleb Smith","Courbet","Red",4,4.5,52,6,17,1,0,0,0,1950,"Justin","None,None,None",4,398.31831831831829,"Caleb Smith",398.31831831831829]
["Mark Lide","Nagato","Blue",6,6,15,5,11,0,1,0,0,580,"Rick","None,None,None",10,1472.2222222222222,"Mark Lide",1472.2222222222222]
["Michael Smith","Seydlitz","Blue",4,4.5,42,8,15,0,1,0,0,1030,"Kevin","None,None,None",8,1177.7777777777778,"Michael Smith",1177.7777777777778]
["Matt Larson","Nagato","Blue",6,6,12,4,14,0,1,0,0,620,"Kevin","None,None,None",10,1472.2222222222222,"Matt Larson",1472.2222222222222]
["Brian Koehler","Jamaica","Blue",2,2.5,2,0,0,0,1,0,0,20,"Rick","None,None,None",6,883.33333333333337,"Brian Koehler",883.33333333333337]
["Rick Whitsell","Jamaica","Red",2,2.5,1,0,0,0,0,0,0,10,"Brian K","None,None,None",3,298.73873873873873,"Rick Whitsell",298.73873873873873]
["Peter Ellison","Erin","Blue",4,4.5,23,4,4,0,1,0,0,430,"Lou","None,None,None",8,1177.7777777777778,"Peter Ellison",1177.7777777777778]
["John Jones","Z Boat","Blue",1,1.5,1,0,3,0,1,0,0,100,"Rick","None,None,None",4,588.88888888888891,"John Jones",588.88888888888891]
["Philip Pace","Z Boat","Blue",1,1.5,0,0,0,0,1,0,0,0,"Rick","None,None,None",4,588.88888888888891,"Philip Pace",588.88888888888891]

{"sheet":"Nats Mon 2","index":20,"n_rows":50,"n_cols":20,"rows_kept":50,"cut":false,"hidden":false,"merged":[]}
[null,null,null,null,null,null,null,null,"Winner:",{"$f":"IF(K2>K3, B2, IF(K3>K2, B3, \"Tie\"))","v":"Blue"},null,"Battle Type","Battle Location and Month (i.e. MD May)","Nats",null,null,null,null,"Fleet"]
["Fleet 1 :","Red",null,"Fleet Units:",112,"Fleet Weight:",185.5,"Fleet Battle Damage:",24970,"Fleet Score:",23770.001953125,null,"Battle Day","Mon",null,null,null,null,"Mini-Fleet"]
["Fleet 2 :","Blue",null,"Fleet Units:",116.5,"Fleet Weight:",178.5,"Fleet Battle Damage:",23770,"Fleet Score:",24169.998046875,null,"Battle Number",2,null,null,null,null,"Individual"]
["Captian","Ship","Fleet","Class","Units","Above","On","Below","Sinks","Participate all Sorties","Penalties Points","2nd Sortie Sink","Damage Points","Scored By","Notes","Weight Factor","Weight Points","Captian","Captain Points","Indiv Points"]
["Carl Bitondo","Deutschland","Blue",3,3.5,16,1,7,0,1,0,0,390,"Lou","None,None,None",7,979.21568627450984,"Carl Bitondo",979.21568627450984]
["Eric Bitondo","Deutschland","Blue",3,3.5,24,2,8,0,1,0,0,520,"Lou","None,None,None",7,979.21568627450984,"Eric Bitondo",979.21568627450984]
["William Tustin","Iron Duke","Red",5,5,23,4,10,0,1,0,0,610,"John Z","None,None,None",9,1153.2614555256064,"William Tustin",1153.2614555256064]
["Brian Koehler","QE","Blue",5,5.5,13,1,8,1,0,0,0,1290,"Ken","None,None,None",4.5,629.49579831932772,"Brian Koehler",629.49579831932772]
["Steve Andrews","Iron Duke","Red",5,5,25,6,19,0,1,0,0,940,"Tyler","None,None,None",9,1153.2614555256064,"Steve Andrews",1153.2614555256064]
["Carl Camurati","Musashi","Red",7,8,125,16,30,0,1,0,0,2470,"Tom T","None,None,None",12,1537.6819407008088,"Carl Camurati",1537.6819407008088]
["Matt Andrews","VV","Red",6,6.5,33,4,16,0,1,0,0,890,"Rob S","None,None,None",10,1281.401617250674,"Matt Andrews",1281.401617250674]
["Gerald Roberts","Kongo","Blue",4,4.5,44,18,23,0,1,0,0,1490,"Tim","None,None,None",8,1119.1036414565826,"Gerald Roberts",1119.1036414565826]
["Chris Pearce","Bismark","Red",6,6.5,22,13,24,0,1,0,0,1200,"John Z","None,None,None",10,1281.401617250674,"Chris Pearce",1281.401617250674]
["Rob Arena","Arizona","Red",5,5.5,86,7,11,0,1,0,0,1330,"Justin R","None,None,None",9,1153.2614555256064,"Rob Arena",1153.2614555256064]
["Nate Graham","West Virginia","Red",5,5.5,57,1,6,1,1,0,1,1670,"Tyler","None,None,None",9,1153.2614555256064,"Nate Graham",953.26145552560638]
["Ginger Andrews","Des Moines","Red",3,3.5,20,2,14,1,1,0,1,1360,"Peter","None,None,None",7,896.98113207547169,"Ginger Andrews",696.98113207547169]
["Justin Ragucci","Rivadavia","Blue",5,5.5,9,1,0,0,1,0,0,110,"rob A","None,None,None",9,1258.9915966386554,"Justin Ragucci",1258.9915966386554]
["Caleb Smith","Courbet","Red",4,4.5,54,7,23,0,1,0,0,1370,"Justin","None,None,None",8,1025.1212938005392,"Caleb Smith",1025.1212938005392]
["Cameron Hunt","Nassau","Red",4,4,12,0,9,0,1,0,0,390,"McCoy","None,None,None",8,1025.1212938005392,"Cameron Hunt",1025.1212938005392]
["Tyler Helland","Yamato","Blue",7,8,122,20,33,0,1,0,0,2610,"Craig","None,None,None",12,1678.6554621848738,"Tyler Helland",1678.6554621848738]
["Craig Singer","Bismark","Red",6,6.5,36,7,17,0,1,0,0,1010,"Tyler","None,None,None",10,1281.401617250674,"Craig Singer",1281.401617250674]
["Kas Gaigalas","Washington","Red",6,6,49,6,27,0,1,0,0,1420,"Zach H","None,None,None",10,1281.401617250674,"Kas Gaigalas",1281.401617250674]
["Ken Arena","Iron Duke","Red",5,5,35,1,6,0,1,0,0,550,"Brian K","None,None,None",9,1153.2614555256064,"Ken Arena",1153.2614555256064]
["Kevin Sundberg","Iron Duke","Red",5,5,12,4,15,0,0,0,0,650,"Rob S","None,None,None",4.5,576.63072776280319,"Kevin Sundberg",576.63072776280319]
["Robert Stalnaker","Baden","Blue",5,5.5,21,7,23,1,1,0,1,1940,"Matt A","None,None,None",9,1258.9915966386554,"Robert Stalnaker",1058.9915966386554]
["Tom Tanner","Ostfriesland","Blue",4,4.5,18,2,5,0,1,0,0,370,"Carl","None,None,None",8,1119.1036414565826,"Tom Tanner",1119.1036414565826]
["Alex Hampton","Dreadnough","Blue",4,4,5,1,0,1,0,0,0,870,"Ginger","None,None,None",4,559.55182072829132,"Alex Hampton",559.55182072829132]
["John Zaruba","Andra Doria","Blue",4,4.5,81,2,47,0,1,0,0,2260,"Kevin S","None,None,None",8,1119.1036414565826,"John Zaruba",1119.1036414565826]
["Ted Buehring","Prinz Eugen","Blue",3,3.5,2,0,0,0,0,0,0,20,"Kevin S","None,None,None",3.5,489.60784313725492,"Ted Buehring",489.60784313725492]
["Ted Buehring","VDT","Blue",4,4,18,7,8,0,0,800,0,560,"Kevin S","Withdraw,None,None",4,-240.44817927170868,"Ted Buehring",-240.44817927170868]
["Timothy Beckett","Bismark","Red",6,6.5,51,14,69,0,1,0,0,2860,"Andy","None,None,None",10,1281.401617250674,"Timothy Beckett",1281.401617250674]
["Lee McKinzie","Iron Duke","Red",5,5,64,16,37,0,1,0,0,2070,"Tom T","None,None,None",9,1153.2614555256064,"Lee McKinzie",1153.2614555256064]
["Jeff Lide","Yamato","Blue",7,8,59,18,33,0,1,0,0,1940,"Tim ","None,None,None",12,1678.6554621848738,"Jeff Lide",1678.6554621848738]
["Lou Meszaros","Courbet","Red",4,4.5,38,9,21,0,1,0,0,1190,"Alex","None,None,None",8,1025.1212938005392,"Lou Meszaros",1025.1212938005392]
["Kevin Plumer","Scharnhorst","Red",5,5.5,41,4,17,0,1,0,0,1000,"Peter","None,None,None",9,1153.2614555256064,"Kevin Plumer",1153.2614555256064]
["Andy Terpstra","Nagato","Blue",6,6,70,10,10,0,1,0,0,1200,"Lee","None,None,None",10,1398.8795518207282,"Andy Terpstra",1398.8795518207282]
["Bob Hoernemann","Nagato","Blue",6,6,35,4,13,1,0,0,0,1820,"Craig","None,None,None",5,699.43977591036412,"Bob Hoernemann",699.43977591036412]
["Bob Hoernemann","Radetzky","Blue",3,3.5,4,3,3,0,0,0,0,190,"Craig","None,None,None",3.5,489.60784313725492,"Bob Hoernemann",489.60784313725492]
["Zach Hoernemann","Nagato","Blue",6,6,100,5,11,0,1,0,0,1430,"Caleb","None,None,None",10,1398.8795518207282,"Zach Hoernemann",1398.8795518207282]
["Brian Lamb","NC","Red",6,6,12,6,2,0,1,0,0,300,"Brian K","None,None,None",10,1281.401617250674,"Brian Lamb",1281.401617250674]
["Michael Smith","Seydlitz","Blue",4,4.5,18,2,5,0,1,0,0,370,"Caleb","None,None,None",8,1119.1036414565826,"Michael Smith",1119.1036414565826]
["McCoy Helland","Zara","Blue",3,3,0,0,0,0,1,0,0,0,"Cameron","None,None,None",7,979.21568627450984,"McCoy Helland",979.21568627450984]
["Matt Mullis","Prinz Eugen","Blue",3,3.5,15,15,16,0,1,0,0,930,"Kevin S","None,None,None",7,979.21568627450984,"Matt Mullis",979.21568627450984]
["Mark Lide","Nagato","Blue",6,6,25,4,17,0,1,0,0,840,"Tom P","None,None,None",10,1398.8795518207282,"Mark Lide",1398.8795518207282]
["Peter Ellison","Erin","Blue",4,4.5,53,9,10,1,0,0,0,1810,"Kevin ","None,None,None",4,559.55182072829132,"Peter Ellison",559.55182072829132]
["Tom Palmer","QE","Red",5,5.5,43,4,36,0,1,0,0,1590,"Mark L","None,None,None",9,1153.2614555256064,"Tom Palmer",1153.2614555256064]
["Matt Larson","Nagato","Blue",6,6,50,5,6,0,1,0,0,780,"Craig","None,None,None",10,1398.8795518207282,"Matt Larson",1398.8795518207282]
["John Jones","Z Boat","Blue",1,1.5,0,0,0,0,1,0,0,0,"Rick","None,None,None",4,559.55182072829132,"John Jones",559.55182072829132]
["Philip Pace","Z Boat","Blue",1,1.5,1,1,0,0,1,0,0,30,"Rick","None,None,None",4,559.55182072829132,"Philip Pace",559.55182072829132]
["Rick Whitsell","Jamaica","Red",2,2.5,10,0,0,0,1,0,0,100,"John","None,None,None",6,768.8409703504044,"Rick Whitsell",768.8409703504044]

{"sheet":"Nats Mon 1","index":21,"n_rows":47,"n_cols":20,"rows_kept":47,"cut":false,"hidden":false,"merged":[]}
[null,null,null,null,null,null,null,null,"Winner:",{"$f":"IF(K2>K3, B2, IF(K3>K2, B3, \"Tie\"))","v":"Blue"},null,"Battle Type","Battle Location and Month (i.e. MD May)","Nats",null,null,null,null,"Fleet"]
["Fleet 1 :","Red",null,"Fleet Units:",107.5,"Fleet Weight:",182,"Fleet Battle Damage:",31020,"Fleet Score:",25709.998046875,null,"Battle Day","Mon",null,null,null,null,"Mini-Fleet"]
["Fleet 2 :","Blue",null,"Fleet Units:",110,"Fleet Weight:",190,"Fleet Battle Damage:",25710,"Fleet Score:",31019.998046875,null,"Battle Number",1,null,null,null,null,"Individual"]
["Captian","Ship","Fleet","Class","Units","Above","On","Below","Sinks","Participate all Sorties","Penalties Points","2nd Sortie Sink","Damage Points","Scored By","Notes","Weight Factor","Weight Points","Captian","Captain Points","Indiv Points"]
["Matt Larson","Nagato","Blue",6,6,21,1,1,1,1,0,1,1260,"Kevin","None,None,None",10,1632.6315789473683,"Matt Larson",1432.6315789473683]
["Kas Gaigalas","Washington","Red",6,6,32,8,14,0,1,0,0,900,"Peter","None,None,None",10,1412.6373626373627,"Kas Gaigalas",1412.6373626373627]
["Steve Andrews","Iron Duke","Red",5,5,20,3,14,0,1,0,0,680,"Alex","None,None,None",9,1271.3736263736264,"Steve Andrews",1271.3736263736264]
["Robert Stalnaker","Baden","Blue",5,5.5,5,1,2,0,1,0,0,130,"Kevin","None,None,None",9,1469.3684210526317,"Robert Stalnaker",1469.3684210526317]
["Caleb Smith","Courbet","Red",4,4.5,82,10,43,1,1,0,1,3110,"Justin","None,None,None",8,1130.1098901098901,"Caleb Smith",930.1098901098901]
["Jeff Lide","Yamato","Blue",7,8,138,21,50,0,1,0,0,3300,"Steve","None,None,None",12,1959.1578947368421,"Jeff Lide",1959.1578947368421]
["Tom Palmer","QE","Red",5,5.5,44,20,33,1,1,0,1,2730,"Peter","None,None,None",9,1271.3736263736264,"Tom Palmer",1071.3736263736264]
["Andy Terpstra","Nagato","Blue",6,6,63,18,43,0,1,0,0,2280,"Nate","None,None,None",10,1632.6315789473683,"Andy Terpstra",1632.6315789473683]
["Rick Whitsell","Jamaica","Red",2,2.5,15,3,0,0,1,0,0,210,"John J","None,None,None",6,847.58241758241763,"Rick Whitsell",847.58241758241763]
["Ken Arena","Iron Duke","Red",5,5,32,6,10,0,1,0,0,740,"Brian K","None,None,None",9,1271.3736263736264,"Ken Arena",1271.3736263736264]
["William Tustin","Iron Duke","Red",5,5,64,9,29,0,1,0,0,1690,"Tyler","None,None,None",9,1271.3736263736264,"William Tustin",1271.3736263736264]
["Michael Smith","Seydlitz","Blue",4,4.5,8,2,5,0,1,0,0,270,"Ginger","None,None,None",8,1306.1052631578948,"Michael Smith",1306.1052631578948]
["Peter Ellison","Erin","Blue",4,4.5,30,5,1,0,1,0,0,430,"Tom P","None,None,None",8,1306.1052631578948,"Peter Ellison",1306.1052631578948]
["Lee McKinzie","Iron Duke","Red",5,5,11,3,7,0,1,0,0,380,"John Z","None,None,None",9,1271.3736263736264,"Lee McKinzie",1271.3736263736264]
["Gerald Roberts","Nagato","Blue",6,6,134,22,51,1,1,0,1,4310,"Tim","None,None,None",10,1632.6315789473683,"Gerald Roberts",1432.6315789473683]
["Tom Tanner","Deutschland","Blue",3,3.5,3,1,2,0,1,0,0,110,"Carl","None,None,None",7,1142.8421052631577,"Tom Tanner",1142.8421052631577]
["Chris Pearce","Bismark","Red",6,6.5,59,12,47,0,1,0,0,2240,"Peter","None,None,None",10,1412.6373626373627,"Chris Pearce",1412.6373626373627]
["Brian Lamb","NC","Red",6,6,21,1,4,0,1,0,0,350,"Peter","None,None,None",10,1412.6373626373627,"Brian Lamb",1412.6373626373627]
["Carl Camurati","Musashi","Red",7,8,94,8,28,1,1,0,1,3140,"Tom T","None,None,None",12,1695.1648351648353,"Carl Camurati",1495.1648351648353]
["Brian Koehler","QE","Blue",5,5.5,21,0,3,1,1,0,1,1200,"Ken","None,None,None",9,1469.3684210526317,"Brian Koehler",1269.3684210526317]
["McCoy Helland","Zara","Blue",3,3,14,1,1,0,1,0,0,190,"Cameron","None,None,None",7,1142.8421052631577,"McCoy Helland",1142.8421052631577]
["Nate Graham","West Virginia","Red",5,5.5,86,9,31,1,1,0,1,2870,"Tyler","None,None,None",9,1271.3736263736264,"Nate Graham",1071.3736263736264]
["Tyler Helland","Yamato","Blue",7,8,94,8,23,0,1,0,0,1790,"Craig","None,None,None",12,1959.1578947368421,"Tyler Helland",1959.1578947368421]
["John Jones","Z Boat","Blue",1,1.5,3,1,0,0,1,0,0,50,"Rick","None,None,None",4,653.0526315789474,"John Jones",653.0526315789474]
["Alex Hampton","Dreadnough","Blue",4,4,13,2,5,1,0,0,0,1120,"Rob A","None,None,None",4,653.0526315789474,"Alex Hampton",653.0526315789474]
["Ginger Andrews","Des Moines","Red",3,3.5,15,0,2,0,1,0,0,210,"Ted","None,None,None",7,988.84615384615392,"Ginger Andrews",988.84615384615392]
["Kevin Sundberg","Iron Duke","Red",5,5,13,4,14,0,1,0,0,630,"Carl B","None,None,None",9,1271.3736263736264,"Kevin Sundberg",1271.3736263736264]
["Eric Bitondo","Deutschland","Blue",3,3.5,22,1,2,0,1,0,0,300,"Kevin S","None,None,None",7,1142.8421052631577,"Eric Bitondo",1142.8421052631577]
["Carl Bitondo","Deutschland","Blue",3,3.5,35,3,16,1,1,0,1,1590,"Kevin S","None,None,None",7,1142.8421052631577,"Carl Bitondo",942.84210526315769]
["Matt Andrews","VV","Red",6,6.5,78,6,40,0,1,0,0,2100,"Justin","None,None,None",10,1412.6373626373627,"Matt Andrews",1412.6373626373627]
["Kevin Plumer","Scharnhorst","Red",5,5.5,54,3,13,1,1,0,1,1890,"Tyler","None,None,None",9,1271.3736263736264,"Kevin Plumer",1071.3736263736264]
["Matt Mullis","Prinz Eugen","Blue",3,3.5,0,0,1,0,1,0,0,30,"Kevin P","None,None,None",7,1142.8421052631577,"Matt Mullis",1142.8421052631577]
["Philip Pace","Z Boat","Blue",1,1.5,6,0,1,0,1,0,0,90,"Rick","None,None,None",4,653.0526315789474,"Philip Pace",653.0526315789474]
["Zach Hoernemann","Nagato","Blue",6,6,20,2,16,0,1,0,0,720,"Tom P","None,None,None",10,1632.6315789473683,"Zach Hoernemann",1632.6315789473683]
["Cameron Hunt","Nassau","Red",4,4,32,5,11,0,1,0,0,750,"McCoy","None,None,None",8,1130.1098901098901,"Cameron Hunt",1130.1098901098901]
["John Zaruba","Andra Doria","Blue",4,4.5,196,15,39,1,1,0,1,4230,"Kevin P","None,None,None",8,1306.1052631578948,"John Zaruba",1106.1052631578948]
["Justin Ragucci","Rivadavia","Blue",5,5.5,11,1,5,0,1,0,0,280,"Rob","None,None,None",9,1469.3684210526317,"Justin Ragucci",1469.3684210526317]
["Rob Arena","Arizona","Red",5,5.5,72,4,17,0,1,0,0,1310,"Justin","None,None,None",9,1271.3736263736264,"Rob Arena",1271.3736263736264]
["Ted Buehring","VDT","Blue",4,4,3,1,1,0,1,0,0,80,"Tim","None,None,None",8,1306.1052631578948,"Ted Buehring",1306.1052631578948]
["Craig Singer","Bismark","Red",6,6.5,70,16,56,0,1,0,0,2700,"Tyler","None,None,None",10,1412.6373626373627,"Craig Singer",1412.6373626373627]
["Mark Lide","Nagato","Blue",6,6,53,4,22,0,1,0,0,1270,"Tom P","None,None,None",10,1632.6315789473683,"Mark Lide",1632.6315789473683]
["Bob Hoernemann","Nagato","Blue",6,6,27,4,11,0,1,0,0,680,"Caleb","None,None,None",10,1632.6315789473683,"Bob Hoernemann",1632.6315789473683]
["Timothy Beckett","Bismark","Red",6,6.5,55,14,52,0,1,0,0,2390,"Andy","None,None,None",10,1412.6373626373627,"Timothy Beckett",1412.6373626373627]

{"sheet":"LA Nov Sun 2","index":22,"n_rows":17,"n_cols":20,"rows_kept":17,"cut":false,"hidden":false,"merged":[]}
[null,null,null,null,null,null,null,null,"Winner:",{"$f":"IF(K2>K3, B2, IF(K3>K2, B3, \"Tie\"))","v":"Flag"},null,"Battle Type","Battle Location and Month (i.e. MD May)","LA Nov",null,null,null,null,"Fleet"]
["Fleet 1 :","Flag",null,"Fleet Units:",33,"Fleet Weight:",54,"Fleet Battle Damage:",6430,"Fleet Score:",8870,null,"Battle Day","Sun",null,null,null,null,"Mini-Fleet"]
["Fleet 2 :","No Flag",null,"Fleet Units:",29.5,"Fleet Weight:",54,"Fleet Battle Damage:",9170,"Fleet Score:",6430,null,"Battle Number",2,null,null,null,null,"Individual"]
["Captian","Ship","Fleet","Class","Units","Above","On","Below","Sinks","Participate all Sorties","Penalties Points","2nd Sortie Sink","Damage Points","Scored By","Notes","Weight Factor","Weight Points","Captian","Captain Points","Indiv Points"]
["Bob Hoernemann","Kongo","No Flag",4,4.5,37,1,54,1,1,0,1,2810,"Bob","None,None,None",8,952.5925925925925,"Bob Hoernemann",752.5925925925925]
["Michael Smith","Seydlitz","No Flag",4,4.5,33,13,6,0,1,0,0,770,"Mike","None,None,None",8,952.5925925925925,"Michael Smith",952.5925925925925]
["John Zaruba","Andra Doria","No Flag",4,4.5,29,5,8,0,1,0,0,630,"John","None,None,None",8,952.5925925925925,"John Zaruba",952.5925925925925]
["Rick Whitsell","Jamaica","No Flag",2,2.5,8,2,0,0,1,0,0,120,"Rick","None,None,None",6,714.44444444444446,"Rick Whitsell",714.44444444444446]
["Andy Terpstra","QE","No Flag",5,5.5,60,17,23,1,1,0,1,2530,"Andy","None,None,None",9,1071.6666666666665,"Andy Terpstra",871.66666666666652]
["Gerald Roberts","Kongo","Flag",4,4.5,30,5,23,0,1,0,0,1090,"Gerald","None,None,None",8,1358.5185185185185,"Gerald Roberts",1358.5185185185185]
["David Haynes","Kongo","No Flag",4,4.5,35,6,9,0,1,0,0,740,"Dirty","None,None,None",8,952.5925925925925,"David Haynes",952.5925925925925]
["Ted Buehring","Prinz Eugen","No Flag",3,3.5,26,2,19,1,1,0,1,1570,"Ted","None,None,None",7,833.51851851851848,"Ted Buehring",633.51851851851848]
["Matt Mullis","Prinz Eugen","Flag",3,3.5,1,1,0,0,1,0,0,30,"Matt","None,None,None",7,1188.7037037037037,"Matt Mullis",1188.7037037037037]
["Brandon Smith","Nagato","Flag",6,6,19,8,20,0,1,100,0,950,"Brandon","Ram above,None,None",10,1598.148148148148,"Brandon Smith",1598.148148148148]
["Matt Larson","Nagato","Flag",6,6,32,8,20,0,1,0,0,1080,"Matt","None,None,None",10,1698.148148148148,"Matt Larson",1698.148148148148]
["Tom Palmer","West Virginia","Flag",5,5,11,16,29,0,1,200,0,1300,"Tom","Ram below,None,None",9,1328.3333333333333,"Tom Palmer",1328.3333333333333]
["Jeff Lide","Yamato","Flag",7,8,58,7,42,0,1,0,0,1980,"Jeff","None,None,None",10,1698.148148148148,"Jeff Lide",1698.148148148148]

{"sheet":"LA Nov Sun 1","index":23,"n_rows":18,"n_cols":20,"rows_kept":18,"cut":false,"hidden":false,"merged":[]}
[null,null,null,null,null,null,null,null,"Winner:",{"$f":"IF(K2>K3, B2, IF(K3>K2, B3, \"Tie\"))","v":"Flag"},null,"Battle Type","Battle Location and Month (i.e. MD May)","LA Nov",null,null,null,null,"Fleet"]
["Fleet 1 :","Flag",null,"Fleet Units:",29,"Fleet Weight:",52,"Fleet Battle Damage:",2750,"Fleet Score:",13349.9990234375,null,"Battle Day","Sun",null,null,null,null,"Mini-Fleet"]
["Fleet 2 :","No Flag",null,"Fleet Units:",34,"Fleet Weight:",60,"Fleet Battle Damage:",13350,"Fleet Score:",2750,null,"Battle Number",1,null,null,null,null,"Individual"]
["Captian","Ship","Fleet","Class","Units","Above","On","Below","Sinks","Participate all Sorties","Penalties Points","2nd Sortie Sink","Damage Points","Scored By","Notes","Weight Factor","Weight Points","Captian","Captain Points","Indiv Points"]
["Jeff Zaruba","Glorie","Flag",2,2.5,3,2,0,0,1,0,0,70,"Jeff","None,None,None",6,1540.3846153846155,"Jeff Zaruba",1540.3846153846155]
["Mackinzyee Zaruba","Glorie","Flag",2,2.5,8,1,1,0,1,0,0,130,"Glorie","None,None,None",6,1540.3846153846155,"Mackinzyee Zaruba",1540.3846153846155]
["Ted Buehring","Prinz Eugen","Flag",3,3.5,6,0,3,0,1,0,0,150,"Ted","None,None,None",7,1797.1153846153845,"Ted Buehring",1797.1153846153845]
["Matt Mullis","Prinz Eugen","Flag",3,3.5,2,0,0,0,1,0,0,20,"Matt","None,None,None",7,1797.1153846153845,"Matt Mullis",1797.1153846153845]
["Gerald Roberts","Kongo","Flag",4,4.5,33,2,14,0,1,0,0,790,"Gerald","None,None,None",8,2053.8461538461538,"Gerald Roberts",2053.8461538461538]
["Jeff Lide","Yamato","Flag",7,8,48,7,21,0,1,0,0,1250,"Jeff","None,None,None",10,2567.3076923076924,"Jeff Lide",2567.3076923076924]
["David Haynes","Kongo","Flag",4,4.5,16,3,4,0,1,0,0,340,"Dave","None,None,None",8,2053.8461538461538,"David Haynes",2053.8461538461538]
["Tom Palmer","West Virginia","No Flag",5,5,71,12,38,1,1,0,1,2990,"Tom","None,None,None",9,412.5,"Tom Palmer",212.5]
["Andy Terpstra","QE","No Flag",5,5.5,18,16,33,0,1,0,0,1490,"Andy","None,None,None",9,412.5,"Andy Terpstra",412.5]
["Brandon Smith","Nagato","No Flag",6,6,38,7,30,1,1,0,1,2420,"Brandon","None,None,None",10,458.33333333333331,"Brandon Smith",258.33333333333331]
["Michael Smith","Seydlitz","No Flag",4,4.5,44,16,16,0,1,0,0,1240,"Mike","None,None,None",8,366.66666666666669,"Michael Smith",366.66666666666669]
["Matt Larson","Nagato","No Flag",6,6,47,3,35,1,1,0,1,2580,"Matt","None,None,None",10,458.33333333333331,"Matt Larson",258.33333333333331]
["Bob Hoernemann","Kongo","No Flag",4,4.5,49,2,22,1,1,0,1,1990,"Bob","None,None,None",8,366.66666666666669,"Bob Hoernemann",166.66666666666669]
["Rick Whitsell","Jamaica","No Flag",2,2.5,27,8,7,0,1,0,0,640,"Rick","None,None,None",6,275,"Rick Whitsell",275]

{"sheet":"LA Nov Sat 3","index":24,"n_rows":16,"n_cols":20,"rows_kept":16,"cut":false,"hidden":false,"merged":[]}
[null,null,null,null,null,null,null,null,"Winner:",{"$f":"IF(K2>K3, B2, IF(K3>K2, B3, \"Tie\"))","v":"Flag"},null,"Battle Type","Battle Location and Month (i.e. MD May)","LA Nov",null,null,null,null,"Fleet"]
["Fleet 1 :","Flag",null,"Fleet Units:",26,"Fleet Weight:",43,"Fleet Battle Damage:",6780,"Fleet Score:",8640,null,"Battle Day","Sat",null,null,null,null,"Mini-Fleet"]
["Fleet 2 :","No Flag",null,"Fleet Units:",32,"Fleet Weight:",57,"Fleet Battle Damage:",8640,"Fleet Score:",6780,null,"Battle Number",3,null,null,null,null,"Individual"]
["Captian","Ship","Fleet","Class","Units","Above","On","Below","Sinks","Participate all Sorties","Penalties Points","2nd Sortie Sink","Damage Points","Scored By","Notes","Weight Factor","Weight Points","Captian","Captain Points","Indiv Points"]
["Andy Terpstra","QE","No Flag",5,5.5,56,12,20,0,1,0,0,1400,"Andy","None,None,None",9,1070.5263157894735,"Andy Terpstra",1070.5263157894735]
["Jeff Lide","Yamato","Flag",7,8,28,5,10,0,1,0,0,680,"Jeff","None,None,None",10,2009.3023255813953,"Jeff Lide",2009.3023255813953]
["Matt Larson","Nagato","Flag",6,6,31,5,27,0,1,0,0,1220,"Matt","None,None,None",10,2009.3023255813953,"Matt Larson",2009.3023255813953]
["Brandon Smith","Nagato","No Flag",6,6,24,11,31,0,1,0,0,1390,"Bradon","None,None,None",10,1189.4736842105262,"Brandon Smith",1189.4736842105262]
["Tom Palmer","West Virginia","Flag",5,5,54,14,18,0,1,0,0,1360,"Tom","None,None,None",9,1808.372093023256,"Tom Palmer",1808.372093023256]
["Michael Smith","Seydlitz","No Flag",4,4.5,20,16,4,0,1,0,0,640,"Mike","None,None,None",8,951.57894736842104,"Michael Smith",951.57894736842104]
["Matt Mullis","Prinz Eugen","No Flag",3,3.5,2,0,0,0,1,0,0,20,"Matt","None,None,None",7,832.63157894736833,"Matt Mullis",832.63157894736833]
["Andy Terpstra","QE","No Flag",5,5.5,76,21,37,1,1,0,1,3190,"Andy","None,None,None",9,1070.5263157894735,"Andy Terpstra",870.52631578947353]
["Rick Whitsell","Jamaica","No Flag",2,2.5,14,4,1,0,1,0,0,250,"Rick","None,None,None",6,713.68421052631572,"Rick Whitsell",713.68421052631572]
["Bob Hoernemann","Kongo","No Flag",4,4.5,30,4,19,1,1,0,1,1750,"Bob","None,None,None",8,951.57894736842104,"Bob Hoernemann",751.57894736842104]
["Mackinzyee Zaruba","Glorie","Flag",2,2.5,12,2,2,1,1,0,1,820,"Mac","None,None,None",6,1205.5813953488373,"Mackinzyee Zaruba",1005.5813953488373]
["John Zaruba","Andra Doria","Flag",4,4.5,62,13,34,1,1,0,1,2700,"John","None,None,None",8,1607.4418604651162,"John Zaruba",1407.4418604651162]

{"sheet":"LA Nov Sat 2","index":25,"n_rows":14,"n_cols":20,"rows_kept":14,"cut":false,"hidden":false,"merged":[]}
[null,null,null,null,null,null,null,null,"Winner:",{"$f":"IF(K2>K3, B2, IF(K3>K2, B3, \"Tie\"))","v":"No Flag"},null,"Battle Type","Battle Location and Month (i.e. MD May)","LA Nov",null,null,null,null,"Fleet"]
["Fleet 1 :","Flag",null,"Fleet Units:",30.5,"Fleet Weight:",51,"Fleet Battle Damage:",7830,"Fleet Score:",7419.99951171875,null,"Battle Day","Sat",null,null,null,null,"Mini-Fleet"]
["Fleet 2 :","No Flag",null,"Fleet Units:",18.5,"Fleet Weight:",33,"Fleet Battle Damage:",7420,"Fleet Score:",7829.99951171875,null,"Battle Number",2,null,null,null,null,"Individual"]
["Captian","Ship","Fleet","Class","Units","Above","On","Below","Sinks","Participate all Sorties","Penalties Points","2nd Sortie Sink","Damage Points","Scored By","Notes","Weight Factor","Weight Points","Captian","Captain Points","Indiv Points"]
["John Zaruba","Andra Doria","Flag",4,4.5,42,11,15,2,1,0,1,2690,"john","None,None,None",8,1163.9215686274511,"John Zaruba",963.92156862745105]
["Mackinzyee Zaruba","Glorie","Flag",2,2.5,20,3,14,0,1,0,0,680,"john","None,None,None",6,872.94117647058818,"Mackinzyee Zaruba",872.94117647058818]
["Rick Whitsell","Jamaica","No Flag",2,2.5,3,0,0,0,1,0,0,30,"Rick","None,None,None",6,1423.6363636363637,"Rick Whitsell",1423.6363636363637]
["Andy Terpstra","QE","No Flag",5,5.5,106,18,50,1,1,0,1,3820,"Andy","None,None,None",9,2135.4545454545455,"Andy Terpstra",1935.4545454545455]
["Bob Hoernemann","Nagato","No Flag",6,6,32,8,32,0,1,0,0,1440,"Bob","None,None,None",10,2372.727272727273,"Bob Hoernemann",2372.727272727273]
["Brandon Smith","Kongo","No Flag",4,4.5,19,2,10,2,1,0,1,2130,"Brandon","None,None,None",8,1898.1818181818182,"Brandon Smith",1698.1818181818182]
["Matt Larson","Nagato","Flag",6,6,19,2,18,0,1,0,0,770,"Matt","None,None,None",10,1454.9019607843138,"Matt Larson",1454.9019607843138]
["Tom Palmer","West Virginia","Flag",5,5,45,6,26,0,1,0,0,1350,"Tom","None,None,None",9,1309.4117647058824,"Tom Palmer",1309.4117647058824]
["Michael Smith","Seydlitz","Flag",4,4.5,43,12,22,0,1,0,0,1330,"Mike","None,None,None",8,1163.9215686274511,"Michael Smith",1163.9215686274511]
["Jeff Lide","Yamato","Flag",7,8,28,8,19,0,1,0,0,1010,"Jeff","None,None,None",10,1454.9019607843138,"Jeff Lide",1454.9019607843138]

{"sheet":"LA Nov Sat 1","index":26,"n_rows":17,"n_cols":20,"rows_kept":17,"cut":false,"hidden":false,"merged":[]}
[null,null,null,null,null,null,null,null,"Winner:",{"$f":"IF(K2>K3, B2, IF(K3>K2, B3, \"Tie\"))","v":"Flag"},null,"Battle Type","Battle Location and Month (i.e. MD May)","LA Nov",null,null,null,null,"Fleet"]
["Fleet 1 :","Flag",null,"Fleet Units:",33,"Fleet Weight:",57,"Fleet Battle Damage:",7010,"Fleet Score:",8370,null,"Battle Day","Sat",null,null,null,null,"Mini-Fleet"]
["Fleet 2 :","No Flag",null,"Fleet Units:",26,"Fleet Weight:",48,"Fleet Battle Damage:",10170,"Fleet Score:",7010,null,"Battle Number",1,null,null,null,null,"Individual"]
["Captian","Ship","Fleet","Class","Units","Above","On","Below","Sinks","Participate all Sorties","Penalties Points","2nd Sortie Sink","Damage Points","Scored By","Notes","Weight Factor","Weight Points","Captian","Captain Points","Indiv Points"]
["John Zaruba","Andra Doria","Flag",4,4.5,79,15,48,0,1,0,0,2530,"John","None,None,None",8,1427.3684210526314,"John Zaruba",1427.3684210526314]
["Michael Smith","Seydlitz","No Flag",4,4.5,55,20,10,0,1,0,0,1250,"Mike","None,None,None",8,1168.3333333333333,"Michael Smith",1168.3333333333333]
["Gerald Roberts","Kongo","No Flag",4,4.5,47,11,19,0,1,0,0,1260,"Gerlad","None,None,None",8,1168.3333333333333,"Gerald Roberts",1168.3333333333333]
["Ted Buehring","VDT","No Flag",4,4,8,5,22,1,1,0,1,1640,"Ted","None,None,None",8,1168.3333333333333,"Ted Buehring",968.33333333333326]
["Tom Palmer","West Virginia","Flag",5,5,24,8,13,0,1,0,0,790,"Tom","None,None,None",9,1605.7894736842104,"Tom Palmer",1605.7894736842104]
["Jeff Lide","Yamato","Flag",7,8,53,7,8,0,1,1800,0,910,"Jeff","Declared sunk,None,None",10,-15.789473684210634,"Jeff Lide",-15.789473684210634]
["Matt Larson","Nagato","Flag",6,6,77,8,28,0,1,0,0,1770,"matt","None,None,None",10,1784.2105263157894,"Matt Larson",1784.2105263157894]
["David Haynes","Kongo","Flag",4,4.5,3,0,0,1,1,0,1,830,"Dave","None,None,None",8,1427.3684210526314,"David Haynes",1227.3684210526314]
["Jeff Zaruba","Glorie","Flag",2,2.5,2,0,2,0,1,0,0,80,"Jeff","None,None,None",6,1070.5263157894735,"Jeff Zaruba",1070.5263157894735]
["Bob Hoernemann","Nagato","No Flag",6,6,69,37,32,1,1,0,1,3390,"Bob","None,None,None",10,1460.4166666666667,"Bob Hoernemann",1260.4166666666667]
["Brandon Smith","Kongo","No Flag",4,4.5,36,4,43,1,1,0,1,2530,"Brandon","None,None,None",8,1168.3333333333333,"Brandon Smith",968.33333333333326]
["Rick Whitsell","Jamaica","No Flag",2,2.5,8,1,0,0,1,0,0,100,"Rick","None,None,None",6,876.25,"Rick Whitsell",876.25]
["Mackinzyee Zaruba","Glorie","Flag",2,2.5,3,2,1,0,1,0,0,100,"john","None,None,None",6,1070.5263157894735,"Mackinzyee Zaruba",1070.5263157894735]

{"sheet":"MN May Sun 2","index":27,"n_rows":15,"n_cols":20,"rows_kept":15,"cut":false,"hidden":false,"merged":[]}
[null,null,null,null,null,null,null,null,"Winner:",{"$f":"IF(K2>K3, B2, IF(K3>K2, B3, \"Tie\"))","v":"Flag"},null,"Battle Type","Battle Location and Month (i.e. MD May)","MN May",null,null,null,null,"Fleet"]
["Fleet 1 :","Flag",null,"Fleet Units:",27,"Fleet Weight:",50,"Fleet Battle Damage:",4330,"Fleet Score:",6890,null,"Battle Day","Sun",null,null,null,null,"Mini-Fleet"]
["Fleet 2 :","No Flag",null,"Fleet Units:",25.5,"Fleet Weight:",44,"Fleet Battle Damage:",6890,"Fleet Score:",4330,null,"Battle Number",2,null,null,null,null,"Individual"]
["Captian","Ship","Fleet","Class","Units","Above","On","Below","Sinks","Participate all Sorties","Penalties Points","2nd Sortie Sink","Damage Points","Scored By","Notes","Weight Factor","Weight Points","Captian","Captain Points","Indiv Points"]
["Andy Terpstra","Nagato","Flag",6,6,52,12,36,0,1,0,0,1840,"Andy","None,None,None",10,1378,"Andy Terpstra",1378]
["Michael Smith","Seydlitz","Flag",4,4.5,45,5,6,0,1,0,0,730,"Mike","None,None,None",8,1102.4000000000001,"Michael Smith",1102.4000000000001]
["Kas Gaigalas","Washington","Flag",6,6,25,0,13,0,1,0,0,640,"Kas","None,None,None",10,1378,"Kas Gaigalas",1378]
["Peter Ellison","Erin","Flag",4,4.5,41,7,11,0,1,0,0,880,"Peter","None,None,None",8,1102.4000000000001,"Peter Ellison",1102.4000000000001]
["McCoy Helland","Zara","Flag",3,3,3,0,0,0,1,0,0,30,"McCoy","None,None,None",7,964.60000000000014,"McCoy Helland",964.60000000000014]
["Tyler Helland","Zara","Flag",3,3,9,0,4,0,1,0,0,210,"Tyler","None,None,None",7,964.60000000000014,"Tyler Helland",964.60000000000014]
["Bob Hoernemann","Nagato","No Flag",6,6,20,4,18,1,1,0,1,1820,"Bob","None,None,None",10,984.09090909090901,"Bob Hoernemann",784.09090909090901]
["Tom Palmer","QE","No Flag",5,5.5,67,6,37,0,1,0,0,1900,"Tom","None,None,None",9,885.68181818181824,"Tom Palmer",885.68181818181824]
["Matt Larson","Nagato","No Flag",6,6,20,3,3,2,1,0,1,2350,"Matt","None,None,None",10,984.09090909090901,"Matt Larson",784.09090909090901]
["Rick Whitsell","Jamaica","No Flag",2,2.5,4,0,0,0,1,0,0,40,"Rick","None,None,None",6,590.45454545454538,"Rick Whitsell",590.45454545454538]
["Nate Graham","West Virginia","No Flag",5,5.5,48,3,8,0,1,0,0,780,"Nate","None,None,None",9,885.68181818181824,"Nate Graham",885.68181818181824]

{"sheet":"MN May Sun 1","index":28,"n_rows":14,"n_cols":20,"rows_kept":14,"cut":false,"hidden":false,"merged":[]}
[null,null,null,null,null,null,null,null,"Winner:",{"$f":"IF(K2>K3, B2, IF(K3>K2, B3, \"Tie\"))","v":"Flag"},null,"Battle Type","Battle Location and Month (i.e. MD May)","MN May",null,null,null,null,"Fleet"]
["Fleet 1 :","Flag",null,"Fleet Units:",24,"Fleet Weight:",43,"Fleet Battle Damage:",4500,"Fleet Score:",7930,null,"Battle Day","Sun",null,null,null,null,"Mini-Fleet"]
["Fleet 2 :","No Flag",null,"Fleet Units:",25.5,"Fleet Weight:",44,"Fleet Battle Damage:",7930,"Fleet Score:",4500,null,"Battle Number",1,null,null,null,null,"Individual"]
["Captian","Ship","Fleet","Class","Units","Above","On","Below","Sinks","Participate all Sorties","Penalties Points","2nd Sortie Sink","Damage Points","Scored By","Notes","Weight Factor","Weight Points","Captian","Captain Points","Indiv Points"]
["Kas Gaigalas","Washington","Flag",6,6,18,1,7,0,1,0,0,410,"Kas","None,None,None",10,1844.1860465116279,"Kas Gaigalas",1844.1860465116279]
["Peter Ellison","Erin","Flag",4,4.5,57,9,19,0,1,0,0,1320,"Peter","None,None,None",8,1475.3488372093022,"Peter Ellison",1475.3488372093022]
["Michael Smith","Seydlitz","Flag",4,4.5,44,6,9,0,1,0,0,830,"Mike","None,None,None",8,1475.3488372093022,"Michael Smith",1475.3488372093022]
["McCoy Helland","Zara","Flag",3,3,6,3,3,1,1,0,1,910,"Mccoy","None,None,None",7,1290.9302325581396,"McCoy Helland",1090.9302325581396]
["Tyler Helland","Nagato","Flag",6,6,33,8,18,0,1,0,0,1030,"Tyler","None,None,None",10,1844.1860465116279,"Tyler Helland",1844.1860465116279]
["Bob Hoernemann","Nagato","No Flag",6,6,40,10,39,2,1,0,1,3770,"Bob","None,None,None",10,1022.7272727272727,"Bob Hoernemann",822.72727272727275]
["Zach Hoernemann","Nagato","No Flag",6,6,36,4,12,0,1,0,0,800,"Zach","None,None,None",10,1022.7272727272727,"Zach Hoernemann",1022.7272727272727]
["Tom Palmer","QE","No Flag",5,5.5,94,10,36,0,1,0,0,2220,"Tom","None,None,None",9,920.4545454545455,"Tom Palmer",920.4545454545455]
["Rick Whitsell","Jamaica","No Flag",2,2.5,3,0,0,0,1,0,0,30,"Rick","None,None,None",6,613.63636363636363,"Rick Whitsell",613.63636363636363]
["Nate Graham","West Virginia","No Flag",5,5.5,91,7,2,0,1,0,0,1110,"nate","None,None,None",9,920.4545454545455,"Nate Graham",920.4545454545455]

{"sheet":"MN May Sat 3","index":29,"n_rows":16,"n_cols":20,"rows_kept":16,"cut":false,"hidden":false,"merged":[]}
[null,null,null,null,null,null,null,null,"Winner:",{"$f":"IF(K2>K3, B2, IF(K3>K2, B3, \"Tie\"))","v":"No Flag"},null,"Battle Type","Battle Location and Month (i.e. MD May)","MN May",null,null,null,null,"Fleet"]
["Fleet 1 :","Flag",null,"Fleet Units:",32.5,"Fleet Weight:",59,"Fleet Battle Damage:",10000,"Fleet Score:",4280,null,"Battle Day","Sat",null,null,null,null,"Mini-Fleet"]
["Fleet 2 :","No Flag",null,"Fleet Units:",26,"Fleet Weight:",45,"Fleet Battle Damage:",4280,"Fleet Score:",10000,null,"Battle Number",3,null,null,null,null,"Individual"]
["Captian","Ship","Fleet","Class","Units","Above","On","Below","Sinks","Participate all Sorties","Penalties Points","2nd Sortie Sink","Damage Points","Scored By","Notes","Weight Factor","Weight Points","Captian","Captain Points","Indiv Points"]
["McCoy Helland","Zara","Flag",3,3,6,3,1,0,1,0,0,150,"Mccoy","None,None,None",7,507.79661016949154,"McCoy Helland",507.79661016949154]
["Kas Gaigalas","Washington","Flag",6,6,64,7,14,0,1,0,0,1200,"Kas","None,None,None",10,725.42372881355925,"Kas Gaigalas",725.42372881355925]
["Tyler Helland","Zara","Flag",3,3,17,7,12,0,1,0,0,670,"Tyler","None,None,None",7,507.79661016949154,"Tyler Helland",507.79661016949154]
["Michael Smith","Seydlitz","Flag",4,4.5,58,5,6,0,1,0,0,860,"Mike","None,None,None",8,580.33898305084745,"Michael Smith",580.33898305084745]
["Zach Hoernemann","Nagato","Flag",6,6,65,5,38,1,1,0,1,2890,"Zach","None,None,None",10,725.42372881355925,"Zach Hoernemann",525.42372881355925]
["Peter Ellison","Erin","Flag",4,4.5,50,21,29,0,1,0,0,1790,"Peter","None,None,None",8,580.33898305084745,"Peter Ellison",580.33898305084745]
["Nate Graham","West Virginia","No Flag",5,5.5,28,1,4,0,1,0,0,420,"Nate","None,None,None",9,2000,"Nate Graham",2000]
["Tom Palmer","QE","Flag",5,5.5,77,10,19,1,1,0,1,2440,"Tom","None,None,None",9,652.88135593220341,"Tom Palmer",452.88135593220341]
["Rick Whitsell","Jamaica","No Flag",2,2.5,5,0,0,0,1,0,0,50,"Rick","None,None,None",6,1333.3333333333333,"Rick Whitsell",1333.3333333333333]
["Matt Larson","Nagato","No Flag",6,6,8,0,0,0,1,0,0,80,"Matt","None,None,None",10,2222.2222222222222,"Matt Larson",2222.2222222222222]
["Andy Terpstra","Nagato","No Flag",6,6,50,14,23,1,1,0,1,2470,"Andy","None,None,None",10,2222.2222222222222,"Andy Terpstra",2022.2222222222222]
["Bob Hoernemann","Nagato","No Flag",6,6,69,9,13,0,1,0,0,1260,"bob","None,None,None",10,2222.2222222222222,"Bob Hoernemann",2222.2222222222222]

{"sheet":"MN May Sat 2","index":30,"n_rows":17,"n_cols":20,"rows_kept":17,"cut":false,"hidden":false,"merged":[]}
[null,null,null,null,null,null,null,null,"Winner:",{"$f":"IF(K2>K3, B2, IF(K3>K2, B3, \"Tie\"))","v":"No Flag"},null,"Battle Type","Battle Location and Month (i.e. MD May)","MN May",null,null,null,null,"Fleet"]
["Fleet 1 :","Flag",null,"Fleet Units:",32,"Fleet Weight:",53,"Fleet Battle Damage:",6740,"Fleet Score:",4060,null,"Battle Day","Sat",null,null,null,null,"Mini-Fleet"]
["Fleet 2 :","No Flag",null,"Fleet Units:",37,"Fleet Weight:",63,"Fleet Battle Damage:",4060,"Fleet Score:",6740,null,"Battle Number",2,null,null,null,null,"Individual"]
["Captian","Ship","Fleet","Class","Units","Above","On","Below","Sinks","Participate all Sorties","Penalties Points","2nd Sortie Sink","Damage Points","Scored By","Notes","Weight Factor","Weight Points","Captian","Captain Points","Indiv Points"]
["McCoy Helland","Zara","Flag",3,3,7,5,5,0,1,0,0,320,"Mccoy","None,None,None",7,536.22641509433959,"McCoy Helland",536.22641509433959]
["Michael Smith","Seydlitz","Flag",4,4.5,58,10,11,0,1,0,0,1110,"Mike","None,None,None",8,612.83018867924523,"Michael Smith",612.83018867924523]
["Zach Hoernemann","Nagato","Flag",6,6,25,7,25,1,1,0,1,2140,"Zach","None,None,None",10,766.03773584905662,"Zach Hoernemann",566.03773584905662]
["Kas Gaigalas","Washington","Flag",6,6,21,3,8,0,1,0,0,510,"kas","None,None,None",10,766.03773584905662,"Kas Gaigalas",766.03773584905662]
["Tyler Helland","Yamato","Flag",7,8,23,0,1,0,1,0,0,260,"Tyler","None,None,None",10,766.03773584905662,"Tyler Helland",766.03773584905662]
["Peter Ellison","Erin","Flag",4,4.5,65,19,19,1,1,0,1,2400,"Peter","None,None,None",8,612.83018867924523,"Peter Ellison",412.83018867924523]
["Bryan Box","Texas","No Flag",5,5.5,47,2,6,0,1,0,0,690,"Bryan","None,None,None",9,962.85714285714278,"Bryan Box",962.85714285714278]
["Andy Terpstra","Nagato","No Flag",6,6,23,7,12,0,1,0,0,730,"Andy","None,None,None",10,1069.8412698412699,"Andy Terpstra",1069.8412698412699]
["Tom Palmer","QE","No Flag",5,5.5,25,3,10,0,1,0,0,610,"Tom","None,None,None",9,962.85714285714278,"Tom Palmer",962.85714285714278]
["Bob Hoernemann","Nagato","No Flag",6,6,68,13,23,0,1,0,0,1630,"Bob","None,None,None",10,1069.8412698412699,"Bob Hoernemann",1069.8412698412699]
["Nate Graham","West Virginia","No Flag",5,5.5,20,2,1,0,1,0,0,270,"Nate","None,None,None",9,962.85714285714278,"Nate Graham",962.85714285714278]
["Matt Larson","Nagato","No Flag",6,6,11,0,0,0,1,0,0,110,"Matt","None,None,None",10,1069.8412698412699,"Matt Larson",1069.8412698412699]
["Rick Whitsell","Jamaica","No Flag",2,2.5,2,0,0,0,1,0,0,20,"Rick","None,None,None",6,641.90476190476181,"Rick Whitsell",641.90476190476181]

{"sheet":"MN May Sat 1","index":31,"n_rows":16,"n_cols":20,"rows_kept":16,"cut":false,"hidden":false,"merged":[]}
[null,null,null,null,null,null,null,null,"Winner:",{"$f":"IF(K2>K3, B2, IF(K3>K2, B3, \"Tie\"))","v":"No Flag"},null,"Battle Type","Battle Location and Month (i.e. MD May)","MN May",null,null,null,null,"Fleet"]
["Fleet 1 :","Flag",null,"Fleet Units:",27.5,"Fleet Weight:",45,"Fleet Battle Damage:",9870,"Fleet Score:",8440,null,"Battle Day","Sat",null,null,null,null,"Mini-Fleet"]
["Fleet 2 :","No Flag",null,"Fleet Units:",35.5,"Fleet Weight:",61,"Fleet Battle Damage:",8440,"Fleet Score:",9870,null,"Battle Number",1,null,null,null,null,"Individual"]
["Captian","Ship","Fleet","Class","Units","Above","On","Below","Sinks","Participate all Sorties","Penalties Points","2nd Sortie Sink","Damage Points","Scored By","Notes","Weight Factor","Weight Points","Captian","Captain Points","Indiv Points"]
["Kas Gaigalas","Washington","Flag",6,6,39,1,8,1,1,0,1,1650,"Kas","None,None,None",10,1875.5555555555554,"Kas Gaigalas",1675.5555555555554]
["Zach Hoernemann","Nagato","Flag",6,6,72,12,33,0,1,0,0,1950,"Zach","None,None,None",10,1875.5555555555554,"Zach Hoernemann",1875.5555555555554]
["McCoy Helland","Zara","Flag",3,3,28,7,1,1,1,0,1,1150,"Mccoy","None,None,None",7,1312.8888888888889,"McCoy Helland",1112.8888888888889]
["Michael Smith","Seydlitz","Flag",4,4.5,53,5,5,0,1,0,0,780,"Andy","None,None,None",8,1500.4444444444446,"Michael Smith",1500.4444444444446]
["Tyler Helland","Yamato","Flag",7,8,190,8,76,0,1,0,0,4340,"Tyler","None,None,None",10,1875.5555555555554,"Tyler Helland",1875.5555555555554]
["Andy Terpstra","Nagato","No Flag",6,6,51,10,47,2,1,0,1,4120,"Andy","None,None,None",10,1618.0327868852457,"Andy Terpstra",1418.0327868852457]
["Peter Ellison","Erin","No Flag",4,4.5,12,4,5,1,1,0,1,1150,"Peter","None,None,None",8,1294.4262295081967,"Peter Ellison",1094.4262295081967]
["Bob Hoernemann","Nagato","No Flag",6,6,58,7,18,0,1,0,0,1260,"Bob","None,None,None",10,1618.0327868852457,"Bob Hoernemann",1618.0327868852457]
["Nate Graham","West Virginia","No Flag",5,5.5,29,1,6,0,1,0,0,490,"Nate","None,None,None",9,1456.2295081967213,"Nate Graham",1456.2295081967213]
["Bryan Box","Texas","No Flag",5,5.5,18,1,3,0,1,0,0,290,"Bryan","None,None,None",9,1456.2295081967213,"Bryan Box",1456.2295081967213]
["Tom Palmer","QE","No Flag",5,5.5,42,5,17,0,1,0,0,1030,"Tom","None,None,None",9,1456.2295081967213,"Tom Palmer",1456.2295081967213]
["Rick Whitsell","Jamaica","No Flag",2,2.5,5,1,1,0,1,0,0,100,"rick","None,None,None",6,970.81967213114751,"Rick Whitsell",970.81967213114751]

{"sheet":"PA Jun Sun 1","index":32,"n_rows":19,"n_cols":20,"rows_kept":19,"cut":false,"hidden":false,"merged":[]}
[null,null,null,null,null,null,null,null,"Winner:",{"$f":"IF(K2>K3, B2, IF(K3>K2, B3, \"Tie\"))","v":"Axis"},null,"Battle Type","Battle Location and Month (i.e. MD May)","PA Jun",null,null,null,null,"Fleet"]
["Fleet 1 :","Allied",null,"Fleet Units:",35,"Fleet Weight:",60.5,"Fleet Battle Damage:",6190,"Fleet Score:",5680,null,"Battle Day","Sun",null,null,null,null,"Mini-Fleet"]
["Fleet 2 :","Axis",null,"Fleet Units:",31,"Fleet Weight:",53.5,"Fleet Battle Damage:",6480,"Fleet Score:",5790,null,"Battle Number",1,null,null,null,null,"Individual"]
["Captian","Ship","Fleet","Class","Units","Above","On","Below","Sinks","Participate all Sorties","Penalties Points","2nd Sortie Sink","Damage Points","Scored By","Notes","Weight Factor","Weight Points","Captian","Captain Points","Indiv Points"]
["Tom Tanner","Deutschland","Axis",3,3.5,12,1,11,0,0,0,0,470,"Tom","None,None,None",3.5,404.95327102803736,"Tom Tanner",404.95327102803736]
["Tom Tanner","Ostfriesland","Axis",4,4.5,13,3,6,2,1,0,1,1970,"Tom","None,None,None",8,925.60747663551399,"Tom Tanner",725.60747663551399]
["Steve Andrews","Nassau","Allied",4,4,25,4,12,1,1,0,1,1490,"Steve","None,None,None",8,856.85950413223145,"Steve Andrews",656.85950413223145]
["Caleb Smith","Des Moines","Axis",3,3.5,36,5,8,1,1,0,1,1400,"Caleb","None,None,None",7,809.90654205607473,"Caleb Smith",609.90654205607473]
["Craig Singer","Nagato","Axis",6,6,11,0,12,0,1,0,0,470,"Ken","None,None,None",10,1157.0093457943924,"Craig Singer",1157.0093457943924]
["Carl Camurati","Nassau","Axis",4,4,21,5,5,0,1,0,0,460,"carl","None,None,None",8,925.60747663551399,"Carl Camurati",925.60747663551399]
["Rob Arena","Arizona","Allied",5,5.5,53,4,23,0,1,0,0,1300,"Matt","None,None,None",9,963.96694214876038,"Rob Arena",963.96694214876038]
["Ken Arena","Iron Duke","Allied",5,5.5,35,1,17,0,1,0,0,880,"Carl","None,None,None",9,963.96694214876038,"Ken Arena",963.96694214876038]
["Kas Gaigalas","Washington","Allied",6,6,69,2,29,0,1,800,0,1600,"Karl","Ram sink,None,None",10,271.07438016528931,"Kas Gaigalas",271.07438016528931]
["Matt Andrews","Iron Duke","Axis",5,5.5,48,2,13,0,1,400,0,910,"Matt","Ram Sink Tromp,None,None",9,641.30841121495314,"Matt Andrews",641.30841121495314]
["Nate Graham","Des Moines","Allied",3,3.5,1,0,1,0,1,0,0,40,"Nate","None,None,None",7,749.75206611570252,"Nate Graham",749.75206611570252]
["William Tustin","Des Moines","Allied",3,3.5,2,0,0,0,1,0,0,20,"Will","None,None,None",7,749.75206611570252,"William Tustin",749.75206611570252]
["Amanda Seltzer","Radetzky","Allied",3,3.5,1,1,0,1,0,0,0,730,"Amanda","None,None,None",3.5,374.87603305785126,"Amanda Seltzer",374.87603305785126]
["Ginger Andrews","Des Moines","Allied",3,3.5,7,0,2,0,1,0,0,130,"Evan","None,None,None",7,749.75206611570252,"Ginger Andrews",749.75206611570252]
["Evan Fowler","VDT","Axis",4,4,43,11,5,0,1,0,0,800,"Evan","None,None,None",8,925.60747663551399,"Evan Fowler",925.60747663551399]

{"sheet":"PA Jun Sat 1","index":33,"n_rows":22,"n_cols":20,"rows_kept":22,"cut":false,"hidden":false,"merged":[]}
[null,null,null,null,null,null,null,null,"Winner:",{"$f":"IF(K2>K3, B2, IF(K3>K2, B3, \"Tie\"))","v":"No Flag"},null,"Battle Type","Battle Location and Month (i.e. MD May)","PA Jun",null,null,null,null,"Fleet"]
["Fleet 1 :","Flag",null,"Fleet Units:",37.5,"Fleet Weight:",50,"Fleet Battle Damage:",11590,"Fleet Score:",7089.99951171875,null,"Battle Day","Sat",null,null,null,null,"Mini-Fleet"]
["Fleet 2 :","No Flag",null,"Fleet Units:",49,"Fleet Weight:",81.5,"Fleet Battle Damage:",8390,"Fleet Score:",11590,null,"Battle Number",1,null,null,null,null,"Individual"]
["Captian","Ship","Fleet","Class","Units","Above","On","Below","Sinks","Participate all Sorties","Penalties Points","2nd Sortie Sink","Damage Points","Scored By","Notes","Weight Factor","Weight Points","Captian","Captain Points","Indiv Points"]
["Brandon Graham","Iron Duke","No Flag",5,5.5,23,7,5,0,1,0,0,520,"Brandon","None,None,None",9,1279.877300613497,"Brandon Graham",1279.877300613497]
["Robert Stalnaker","Baden","Flag",5,5.5,15,1,4,1,1,0,1,1190,"Kas","None,None,None",9,1510.2,"Robert Stalnaker",1310.2]
["Kas Gaigalas","Washington","No Flag",6,6,26,1,10,0,1,0,0,580,"Evan","None,None,None",10,1422.0858895705521,"Kas Gaigalas",1422.0858895705521]
["Rob Arena","Arizona","No Flag",5,5.5,43,4,17,0,1,0,0,1020,"Rob","None,None,None",9,1279.877300613497,"Rob Arena",1279.877300613497]
["Carl Camurati","Nassau","Flag",4,4,15,6,10,0,1,0,0,570,"Carl","None,None,None",8,1342.4,"Carl Camurati",1342.4]
["Tom Tanner","Ostfriesland","Flag",4,4.5,65,13,23,1,0,0,0,2400,"Tom","None,None,None",4,671.2,"Tom Tanner",671.2]
["Matt Andrews","Iron Duke","Flag",5,5.5,32,3,16,0,0,1100,0,860,"Rob","Withdraw,Ram below Rob,None",4.5,-344.9,"Matt Andrews",-344.9]
["Caleb Smith","Courbet","Flag",4,4.5,82,4,36,2,1,200,1,3580,"Rob","Ram Below,None,None",8,1142.4000000000001,"Caleb Smith",942.40000000000009]
["Ken Arena","Iron Duke","No Flag",5,5.5,20,7,17,1,1,0,1,1750,"Matt","None,None,None",9,1279.877300613497,"Ken Arena",1079.877300613497]
["Tom Tanner","Deutschland","Flag",3,3.5,10,3,4,0,0,0,0,280,"Tom","None,None,None",3.5,587.30000000000007,"Tom Tanner",587.30000000000007]
["Evan Fowler","VDT","Flag",4,4,36,1,1,0,1,0,0,410,"Evan","None,None,None",8,1342.4,"Evan Fowler",1342.4]
["William Tustin","Iron Duke","No Flag",5,5.5,41,21,33,0,1,0,0,1820,"Will","None,None,None",9,1279.877300613497,"William Tustin",1279.877300613497]
["Nate Graham","West Virginia","No Flag",5,5.5,45,2,3,0,1,0,0,580,"Nate","None,None,None",9,1279.877300613497,"Nate Graham",1279.877300613497]
["Steve Andrews","Iron Duke","No Flag",5,5.5,13,4,8,0,1,0,0,450,"Steve","None,None,None",9,1279.877300613497,"Steve Andrews",1279.877300613497]
["Ginger Andrews","Des Moines","No Flag",3,3.5,30,4,3,0,0,0,0,470,"Ginger","None,None,None",3.5,497.7300613496933,"Ginger Andrews",497.7300613496933]
["Julie Hayden ","Suffren","No Flag",3,3,12,4,1,0,1,0,0,230,"Tom","None,None,None",7,995.4601226993866,"Julie Hayden ",995.4601226993866]
["Amanda Seltzer","Radetzky","No Flag",3,3.5,7,1,6,1,1,0,1,970,"Amanda","None,None,None",7,995.4601226993866,"Amanda Seltzer",795.4601226993866]
["Craig Singer","Nagato","Flag",6,6,89,15,37,0,0,0,0,2300,"Craig","None,None,None",5,839,"Craig Singer",839]

{"sheet":"PA Jun Fri 2","index":34,"n_rows":18,"n_cols":20,"rows_kept":18,"cut":false,"hidden":false,"merged":[]}
[null,null,null,null,null,null,null,null,"Winner:",{"$f":"IF(K2>K3, B2, IF(K3>K2, B3, \"Tie\"))","v":"No Flag"},null,"Battle Type","Battle Location and Month (i.e. MD May)","PA Jun",null,null,null,null,"Fleet"]
["Fleet 1 :","Flag",null,"Fleet Units:",32,"Fleet Weight:",49.5,"Fleet Battle Damage:",9710,"Fleet Score:",4150,null,"Battle Day","Fri",null,null,null,null,"Mini-Fleet"]
["Fleet 2 :","No Flag",null,"Fleet Units:",38,"Fleet Weight:",62.5,"Fleet Battle Damage:",6050,"Fleet Score:",9710,null,"Battle Number",2,null,null,null,null,"Individual"]
["Captian","Ship","Fleet","Class","Units","Above","On","Below","Sinks","Participate all Sorties","Penalties Points","2nd Sortie Sink","Damage Points","Scored By","Notes","Weight Factor","Weight Points","Captian","Captain Points","Indiv Points"]
["Ginger Andrews","Des Moines","No Flag",3,3.5,7,1,0,0,1,0,0,90,"Caleb","None,None,None",7,1087.52,"Ginger Andrews",1087.52]
["Amanda Seltzer","Radetzky","No Flag",3,3.5,1,2,2,0,1,0,0,110,"Amanda","None,None,None",7,1087.52,"Amanda Seltzer",1087.52]
["Craig Singer","Nagato","Flag",6,6,47,6,35,1,1,0,1,2640,"Craig","None,None,None",10,1222.2222222222222,"Craig Singer",1022.2222222222222]
["Rob Arena","Arizona","Flag",5,5.5,88,5,43,1,1,0,1,3170,"Rob","None,None,None",9,1100,"Rob Arena",900]
["Evan Fowler","VDT","Flag",4,4,40,4,13,0,1,0,0,870,"Amanda","None,None,None",8,977.77777777777783,"Evan Fowler",977.77777777777783]
["Steve Andrews","Iron Duke","No Flag",5,5.5,34,4,9,1,1,0,1,1590,"Evan","None,None,None",9,1398.2399999999998,"Steve Andrews",1198.2399999999998]
["Matt Andrews","VV","Flag",6,6.5,78,6,12,0,1,1000,0,1260,"Matt","Ram sink Kas,None,None",10,222.22222222222217,"Matt Andrews",222.22222222222217]
["Carl Camurati","Nassau","No Flag",4,4,32,13,12,1,1,0,1,1740,"Carl","None,None,None",8,1242.8800000000001,"Carl Camurati",1042.8800000000001]
["Caleb Smith","Courbet","Flag",4,4.5,66,2,33,0,1,0,0,1690,"Caleb","None,None,None",8,977.77777777777783,"Caleb Smith",977.77777777777783]
["Ken Arena","Iron Duke","No Flag",5,5.5,1,0,1,0,0,0,0,40,"Ken","None,None,None",4.5,699.11999999999989,"Ken Arena",699.11999999999989]
["Kas Gaigalas","Washington","No Flag",6,6,33,1,20,0,1,0,0,950,"Rob","None,None,None",10,1553.6000000000001,"Kas Gaigalas",1553.6000000000001]
["Nate Graham","West Virginia","No Flag",5,5.5,18,2,0,0,1,0,0,220,"Nate","None,None,None",9,1398.2399999999998,"Nate Graham",1398.2399999999998]
["William Tustin","Courbet","No Flag",4,4.5,44,24,13,0,1,0,0,1310,"Will","None,None,None",8,1242.8800000000001,"William Tustin",1242.8800000000001]
["Robert Stalnaker","Baden","Flag",5,5.5,8,0,0,0,0,900,0,80,"Rob","Withdraw,None,None",4.5,-350,"Robert Stalnaker",-350]

{"sheet":"PA Jun Fri 1","index":35,"n_rows":16,"n_cols":20,"rows_kept":16,"cut":false,"hidden":false,"merged":[]}
[null,null,null,null,null,null,null,null,"Winner:",{"$f":"IF(K2>K3, B2, IF(K3>K2, B3, \"Tie\"))","v":"No Flag"},null,"Battle Type","Battle Location and Month (i.e. MD May)","PA Jun",null,null,null,null,"Fleet"]
["Fleet 1 :","Flag",null,"Fleet Units:",34.5,"Fleet Weight:",51.5,"Fleet Battle Damage:",6070,"Fleet Score:",2290,null,"Battle Day","Fri",null,null,null,null,"Mini-Fleet"]
["Fleet 2 :","No Flag",null,"Fleet Units:",26,"Fleet Weight:",44,"Fleet Battle Damage:",3090,"Fleet Score:",6020,null,"Battle Number",1,null,null,null,null,"Individual"]
["Captian","Ship","Fleet","Class","Units","Above","On","Below","Sinks","Participate all Sorties","Penalties Points","2nd Sortie Sink","Damage Points","Scored By","Notes","Weight Factor","Weight Points","Captian","Captain Points","Indiv Points"]
["Kas Gaigalas","Washington","No Flag",6,6,19,0,7,0,1,0,0,400,"Rob","None,None,None",10,1379.5454545454545,"Kas Gaigalas",1379.5454545454545]
["Ginger Andrews","Des Moines","No Flag",3,3.5,5,0,1,0,1,0,0,80,"Ginger","None,None,None",7,965.68181818181813,"Ginger Andrews",965.68181818181813]
["Evan Fowler","VDT","Flag",4,4,7,2,3,0,1,0,0,200,"Evan","None,None,None",8,479.99999999999994,"Evan Fowler",479.99999999999994]
["Caleb Smith","Courbet","Flag",4,4.5,77,2,19,1,1,0,1,2180,"Caleb","None,None,None",8,479.99999999999994,"Caleb Smith",279.99999999999994]
["Craig Singer","Nagato","Flag",6,6,26,1,13,0,1,0,0,670,"Craig","None,None,None",10,600,"Craig Singer",600]
["Nate Graham","West Virginia","No Flag",5,5.5,53,1,9,0,1,0,0,820,"Nate","None,None,None",9,1241.5909090909092,"Nate Graham",1241.5909090909092]
["Plato Avramides","Courbet","Flag",4,4.5,27,2,2,0,0,800,0,370,"Plato","Withdraw,None,None",4,-560,"Plato Avramides",-560]
["Plato Avramides","Iron Duke","Flag",5,5.5,29,4,21,0,0,0,0,1000,"Will","None,None,None",4.5,270,"Plato Avramides",270]
["Steve Andrews","Iron Duke","No Flag",5,5.5,24,2,12,1,1,0,1,1540,"Steve","None,None,None",9,1241.5909090909092,"Steve Andrews",1041.5909090909092]
["Amanda Seltzer","Radetzky","Flag",3,3.5,2,0,0,0,1,0,0,20,"Matt","None,None,None",7,420,"Amanda Seltzer",420]
["William Tustin","Iron Duke","No Flag",5,5.5,3,5,4,0,1,50,0,250,"Will","Ram super,None,None",9,1191.5909090909092,"William Tustin",1191.5909090909092]
["Matt Andrews","VV","Flag",6,6.5,77,7,24,0,1,0,0,1630,"Ginger","None,None,None",10,600,"Matt Andrews",600]

{"sheet":"MI May Sun 3","index":36,"n_rows":10,"n_cols":20,"rows_kept":10,"cut":false,"hidden":false,"merged":[]}
[null,null,null,null,null,null,null,null,"Winner:",{"$f":"IF(K2>K3, B2, IF(K3>K2, B3, \"Tie\"))","v":"No Flag"},null,"Battle Type","Battle Location and Month (i.e. MD May)","MI May",null,null,null,null,"Fleet"]
["Fleet 1 :","Flag",null,"Fleet Units:",16.5,"Fleet Weight:",23.5,"Fleet Battle Damage:",2510,"Fleet Score:",1700,null,"Battle Day","Sun",null,null,null,null,"Mini-Fleet"]
["Fleet 2 :","No Flag",null,"Fleet Units:",16,"Fleet Weight:",27,"Fleet Battle Damage:",1700,"Fleet Score:",2510,null,"Battle Number",3,null,null,null,null,"Individual"]
["Captian","Ship","Fleet","Class","Units","Above","On","Below","Sinks","Participate all Sorties","Penalties Points","2nd Sortie Sink","Damage Points","Scored By","Notes","Weight Factor","Weight Points","Captian","Captain Points","Indiv Points"]
["Mark Roe","Baden","Flag",5,5.5,16,2,3,1,0,0,0,1190,"bryan","None,None,None",4.5,325.531914893617,"Mark Roe",325.531914893617]
["Kevin Sundberg","Iron Duke","Flag",5,5,39,9,11,0,1,0,0,900,"Craig","None,None,None",9,651.063829787234,"Kevin Sundberg",651.063829787234]
["William Tustin","Iron Duke","No Flag",5,5,7,2,3,0,1,0,0,200,"Evan","Nonewill,None,None",9,836.66666666666663,"William Tustin",836.66666666666663]
["Bryan Box","Texas","No Flag",5,5.5,35,4,3,1,1,0,1,1420,"Craig","None,None,None",9,836.66666666666663,"Bryan Box",636.66666666666663]
["Kas Gaigalas","Washington","Flag",6,6,21,3,5,0,1,0,0,420,"Craig","None,None,None",10,723.40425531914889,"Kas Gaigalas",723.40425531914889]
["Nate Graham","West Virginia","No Flag",5,5.5,3,1,1,0,1,0,0,80,"Will","None,None,None",9,836.66666666666663,"Nate Graham",836.66666666666663]

{"sheet":"NC Apr Sun 1","index":37,"n_rows":15,"n_cols":20,"rows_kept":15,"cut":false,"hidden":false,"merged":[]}
[null,null,null,null,null,null,null,null,"Winner:",{"$f":"IF(K2>K3, B2, IF(K3>K2, B3, \"Tie\"))","v":"Axis"},null,"Battle Type","Battle Location and Month (i.e. MD May)","NC Apr",null,null,null,null,"Fleet"]
["Fleet 1 :","Allied",null,"Fleet Units:",24.5,"Fleet Weight:",43,"Fleet Battle Damage:",11190,"Fleet Score:",7020,null,"Battle Day","Sun",null,null,null,null,"Mini-Fleet"]
["Fleet 2 :","Axis",null,"Fleet Units:",26.5,"Fleet Weight:",48,"Fleet Battle Damage:",7020,"Fleet Score:",11190,null,"Battle Number",1,null,null,null,null,"Individual"]
["Captian","Ship","Fleet","Class","Units","Above","On","Below","Sinks","Participate all Sorties","Penalties Points","2nd Sortie Sink","Damage Points","Scored By","Notes","Weight Factor","Weight Points","Captian","Captain Points","Indiv Points"]
["Robert Stalnaker","West Virginia","Allied",5,5.5,64,8,20,2,1,0,1,3200,"Rob","None,None,None",9,1469.3023255813955,"Robert Stalnaker",1269.3023255813955]
["Carl Bitondo","Duetsland","Axis",3,3.5,32,5,10,0,1,0,0,720,"Carl","None,None,None",7,1631.875,"Carl Bitondo",1631.875]
["Eric Bitondo","Duetsland","Axis",3,3.5,43,7,10,0,1,0,0,870,"Eric","None,None,None",7,1631.875,"Eric Bitondo",1631.875]
["Brian Koehler","QE","Allied",5,5.5,115,2,4,1,1,0,1,2210,"Kevin","None,None,None",9,1469.3023255813955,"Brian Koehler",1269.3023255813955]
["Kevin Plumer","Scharnhorst","Axis",5,5.5,43,3,32,0,1,0,0,1450,"Kevin","None,None,None",9,2098.125,"Kevin Plumer",2098.125]
["William Tustin","Iron Duke","Allied",5,5,38,15,38,1,1,0,1,2720,"Will","None,None,None",9,1469.3023255813955,"William Tustin",1269.3023255813955]
["Justin Ragucci","Rivadavia","Axis",5,5.5,40,5,14,0,1,0,0,920,"Justin","None,None,None",9,2098.125,"Justin Ragucci",2098.125]
["Steve Andrews","Iron Duke","Allied",5,5,57,34,51,0,1,0,0,2780,"Steve","None,None,None",9,1469.3023255813955,"Steve Andrews",1469.3023255813955]
["Julie Hayden ","VU","Axis",4,4,6,4,1,0,1,0,0,170,"Julie","None,None,None",8,1865,"Julie Hayden ",1865]
["Ginger Andrews","Des Moines","Allied",3,3.5,11,1,5,0,1,0,0,280,"Ginger","None,None,None",7,1142.7906976744187,"Ginger Andrews",1142.7906976744187]
["Tom Tanner","Ostfriesland","Axis",4,4.5,60,25,33,1,1,0,1,2890,"Tom","None,None,None",8,1865,"Tom Tanner",1665]

{"sheet":"GA May Sun 1","index":38,"n_rows":9,"n_cols":20,"rows_kept":9,"cut":false,"hidden":false,"merged":[]}
[null,null,null,null,null,null,null,null,"Winner:",{"$f":"IF(K2>K3, B2, IF(K3>K2, B3, \"Tie\"))","v":"Allied"},null,"Battle Type","Battle Location and Month (i.e. MD May)","GA May",null,null,null,null,"Fleet"]
["Fleet 1 :","Allied",null,"Fleet Units:",11,"Fleet Weight:",18,"Fleet Battle Damage:",1430,"Fleet Score:",1530,null,"Battle Day","Sun",null,null,null,null,"Mini-Fleet"]
["Fleet 2 :","Axis",null,"Fleet Units:",12.5,"Fleet Weight:",23,"Fleet Battle Damage:",1530,"Fleet Score:",1430,null,"Battle Number",1,null,null,null,null,"Individual"]
["Captian","Ship","Fleet","Class","Units","Above","On","Below","Sinks","Participate all Sorties","Penalties Points","2nd Sortie Sink","Damage Points","Scored By","Notes","Weight Factor","Weight Points","Captian","Captain Points","Indiv Points"]
["Brian Koehler","QE","Allied",5,5.5,32,0,2,0,1,0,0,380,"Brian","None,None,None",9,765,"Brian Koehler",765]
["Alex Hampton","Scharnhorst","Allied",5,5.5,52,16,7,0,1,0,0,1050,"Alex","None,None,None",9,765,"Alex Hampton",765]
["Eric Bitondo","Duetsland","Axis",3,3.5,7,1,2,0,1,0,0,150,"Eric","None,None,None",7,435.21739130434787,"Eric Bitondo",435.21739130434787]
["Carl Bitondo","Duetsland","Axis",3,3.5,3,1,1,0,1,0,0,80,"Eric","None,None,None",7,435.21739130434787,"Carl Bitondo",435.21739130434787]
["Christopher Koehler","Rivadavia","Axis",5,5.5,37,21,17,0,1,0,0,1300,"Chris","None,None,None",9,559.56521739130437,"Christopher Koehler",559.56521739130437]

{"sheet":"GA May Sat 1","index":39,"n_rows":10,"n_cols":20,"rows_kept":10,"cut":false,"hidden":false,"merged":[]}
[null,null,null,null,null,null,null,null,"Winner:",{"$f":"IF(K2>K3, B2, IF(K3>K2, B3, \"Tie\"))","v":"No Flag"},null,"Battle Type","Battle Location and Month (i.e. MD May)","GA May",null,null,null,null,"Fleet"]
["Fleet 1 :","Flag",null,"Fleet Units:",15,"Fleet Weight:",26,"Fleet Battle Damage:",4690,"Fleet Score:",540,null,"Battle Day","Sat",null,null,null,null,"Mini-Fleet"]
["Fleet 2 :","No Flag",null,"Fleet Units:",12.5,"Fleet Weight:",23,"Fleet Battle Damage:",540,"Fleet Score:",4690,null,"Battle Number",1,null,null,null,null,"Individual"]
["Captian","Ship","Fleet","Class","Units","Above","On","Below","Sinks","Participate all Sorties","Penalties Points","2nd Sortie Sink","Damage Points","Scored By","Notes","Weight Factor","Weight Points","Captian","Captain Points","Indiv Points"]
["Brian Koehler","QE","Flag",5,5.5,17,0,6,0,1,0,0,350,"Brian","None,None,None",9,186.92307692307691,"Brian Koehler",186.92307692307691]
["Clark Ward","Invincible","Flag",4,4,38,3,4,1,1,0,1,1360,"Clark","None,None,None",8,166.15384615384616,"Clark Ward",-33.84615384615384]
["Alex Hampton","Scharnhorst","Flag",5,5.5,38,16,16,2,1,0,1,2980,"Alex","None,None,None",9,186.92307692307691,"Alex Hampton",-13.076923076923094]
["Carl Bitondo","Duetsland","No Flag",3,3.5,22,2,2,0,1,0,0,320,"Carl","None,None,None",7,1427.3913043478262,"Carl Bitondo",1427.3913043478262]
["Eric Bitondo","Duetsland","No Flag",3,3.5,13,1,1,0,1,0,0,180,"Eric","None,None,None",7,1427.3913043478262,"Eric Bitondo",1427.3913043478262]
["Christopher Koehler","Rivadavia","No Flag",5,5.5,4,0,0,0,1,0,0,40,"Chris","None,None,None",9,1835.217391304348,"Christopher Koehler",1835.217391304348]

{"sheet":"GA Sep Sun 1","index":40,"n_rows":10,"n_cols":20,"rows_kept":10,"cut":false,"hidden":false,"merged":[]}
[null,null,null,null,null,null,null,null,"Winner:",{"$f":"IF(K2>K3, B2, IF(K3>K2, B3, \"Tie\"))","v":"Axis"},null,"Battle Type","Battle Location and Month (i.e. MD May)","GA Sep",null,null,null,null,"Fleet"]
["Fleet 1 :","Allied",null,"Fleet Units:",11,"Fleet Weight:",18,"Fleet Battle Damage:",5010,"Fleet Score:",3250,null,"Battle Day","Sun",null,null,null,null,"Mini-Fleet"]
["Fleet 2 :","Axis",null,"Fleet Units:",17.5,"Fleet Weight:",32,"Fleet Battle Damage:",3250,"Fleet Score:",5010,null,"Battle Number",1,null,null,null,null,"Individual"]
["Captian","Ship","Fleet","Class","Units","Above","On","Below","Sinks","Participate all Sorties","Penalties Points","2nd Sortie Sink","Damage Points","Scored By","Notes","Weight Factor","Weight Points","Captian","Captain Points","Indiv Points"]
["Brian Koehler","QE","Allied",5,5.5,56,2,11,1,1,0,1,1830,"Brian","None,None,None",9,1625,"Brian Koehler",1425]
["Christopher Koehler","Rivadavia","Allied",5,5.5,97,28,25,1,1,0,1,3180,"Chris","None,None,None",9,1625,"Christopher Koehler",1425]
["Alex Hampton","Scharnhorst","Axis",5,5.5,31,5,5,0,1,0,0,560,"Alex","None,None,None",9,1409.0625,"Alex Hampton",1409.0625]
["John Zaruba","Andrea Doria","Axis",4,4.5,43,8,13,2,1,0,1,2580,"John","None,None,None",8,1252.5,"John Zaruba",1052.5]
["Matt Mullis","Lutzow","Axis",3,3.5,0,0,0,0,1,0,0,0,"Matt","None,None,None",7,1095.9375,"Matt Mullis",1095.9375]
["Ted Buehring","VDT","Axis",4,4,6,1,1,0,1,0,0,110,"Ted","None,None,None",8,1252.5,"Ted Buehring",1252.5]

{"sheet":"GA Sep Sat 1","index":41,"n_rows":11,"n_cols":20,"rows_kept":11,"cut":false,"hidden":false,"merged":[]}
[null,null,null,null,null,null,null,null,"Winner:",{"$f":"IF(K2>K3, B2, IF(K3>K2, B3, \"Tie\"))","v":"Allied"},null,"Battle Type","Battle Location and Month (i.e. MD May)","GA Sep",null,null,null,null,"Fleet"]
["Fleet 1 :","Allied",null,"Fleet Units:",11,"Fleet Weight:",21,"Fleet Battle Damage:",1110,"Fleet Score:",4590,null,"Battle Day","Sat",null,null,null,null,"Mini-Fleet"]
["Fleet 2 :","Axis",null,"Fleet Units:",17.5,"Fleet Weight:",32,"Fleet Battle Damage:",4590,"Fleet Score:",1110,null,"Battle Number",1,null,null,null,null,"Individual"]
["Captian","Ship","Fleet","Class","Units","Above","On","Below","Sinks","Participate all Sorties","Penalties Points","2nd Sortie Sink","Damage Points","Scored By","Notes","Weight Factor","Weight Points","Captian","Captain Points","Indiv Points"]
["Ted Buehring","VDT","Axis",4,4,12,7,4,0,1,0,0,380,"Ted","None,None,None",8,277.5,"Ted Buehring",277.5]
["Matt Mullis","Lutzow","Axis",3,3.5,9,1,3,0,1,0,0,200,"Matt","None,None,None",7,242.8125,"Matt Mullis",242.8125]
["John Zaruba","Andrea Doria","Axis",4,4.5,63,4,13,0,1,0,0,1100,"John","None,None,None",8,277.5,"John Zaruba",277.5]
["Brian Koehler","QE","Allied",5,5.5,24,0,3,0,1,0,0,330,"Brian","None,None,None",9,1967.1428571428571,"Brian Koehler",1967.1428571428571]
["John Jones","Gearing","Allied",1,1.5,0,0,0,0,1,0,0,0,"John","None,None,None",4,874.28571428571422,"John Jones",874.28571428571422]
["Clark Ward","Invincible","Allied",4,4,28,7,12,0,1,0,0,780,"Clark","None,None,None",8,1748.5714285714284,"Clark Ward",1748.5714285714284]
["Alex Hampton","Scharnhorst","Axis",5,5.5,71,11,36,1,1,0,1,2910,"Alex","None,None,None",9,312.1875,"Alex Hampton",112.1875]

{"sheet":"LA Mar Sun 2","index":42,"n_rows":17,"n_cols":20,"rows_kept":17,"cut":false,"hidden":false,"merged":[]}
[null,null,null,null,null,null,null,null,"Winner:",{"$f":"IF(K2>K3, B2, IF(K3>K2, B3, \"Tie\"))","v":"Flag"},null,"Battle Type","Battle Location and Month (i.e. MD May)","LA Mar",null,null,null,null,"Fleet"]
["Fleet 1 :","Flag",null,"Fleet Units:",32.5,"Fleet Weight:",53,"Fleet Battle Damage:",5920,"Fleet Score:",8520,null,"Battle Day","Sun",null,null,null,null,"Mini-Fleet"]
["Fleet 2 :","No Flag",null,"Fleet Units:",36,"Fleet Weight:",63,"Fleet Battle Damage:",8520,"Fleet Score:",5920,null,"Battle Number",2,null,null,null,null,"Individual"]
["Captian","Ship","Fleet","Class","Units","Above","On","Below","Sinks","Participate all Sorties","Penalties Points","2nd Sortie Sink","Damage Points","Scored By","Notes","Weight Factor","Weight Points","Captian","Captain Points","Indiv Points"]
["Andy Terpstra","Nagato","No Flag",6,6,40,11,14,0,1,0,0,1040,"Andy","None,None,None",10,939.68253968253964,"Andy Terpstra",939.68253968253964]
["Bob Hoernemann","Nagato","No Flag",6,6,38,19,53,1,1,0,1,3350,"Bob","None,None,None",10,939.68253968253964,"Bob Hoernemann",739.68253968253964]
["Gerald Roberts","Kongo","Flag",4,4.5,15,0,2,0,1,0,0,210,"Gerald","None,None,None",8,1286.0377358490566,"Gerald Roberts",1286.0377358490566]
["Brandon Smith","Nagato","Flag",6,6,27,2,22,0,1,0,0,970,"Nagato","None,None,None",10,1607.5471698113208,"Brandon Smith",1607.5471698113208]
["Jeff Lide","Yamato","Flag",7,8,81,12,40,0,1,0,0,2250,"Jeff","None,None,None",10,1607.5471698113208,"Jeff Lide",1607.5471698113208]
["Johnny Adams","Nagato","Flag",6,6,49,5,11,0,1,0,0,920,"Johhny","None,None,None",10,1607.5471698113208,"Johnny Adams",1607.5471698113208]
["Matt Mullis","Prinz Eugen","No Flag",3,3.5,7,2,2,0,1,0,0,170,"Matt","None,None,None",7,657.77777777777771,"Matt Mullis",657.77777777777771]
["Mark Lide","Nagato","No Flag",6,6,23,16,25,0,1,0,0,1300,"Ted","None,None,None",10,939.68253968253964,"Mark Lide",939.68253968253964]
["Michael Smith","Seydlitz","No Flag",4,4.5,20,3,6,0,1,0,0,440,"Mike","None,None,None",8,751.74603174603169,"Michael Smith",751.74603174603169]
["Michael Tanzillo","Nagato","No Flag",6,6,36,5,7,1,1,0,1,1670,"Mike","None,None,None",10,939.68253968253964,"Michael Tanzillo",739.68253968253964]
["Morgan Preston","VDT","No Flag",4,4,26,4,7,0,1,0,0,550,"Morgan","None,None,None",8,751.74603174603169,"Morgan Preston",751.74603174603169]
["Rick Whitsell","Jamaica","Flag",2,2.5,6,1,1,0,1,0,0,110,"Rick","None,None,None",6,964.52830188679252,"Rick Whitsell",964.52830188679252]
["Tom Palmer","QE","Flag",5,5.5,51,10,25,0,1,0,0,1460,"Tom","None,None,None",9,1446.7924528301885,"Tom Palmer",1446.7924528301885]

{"sheet":"LA Mar Sun 1","index":43,"n_rows":18,"n_cols":20,"rows_kept":18,"cut":false,"hidden":false,"merged":[]}
[null,null,null,null,null,null,null,null,"Winner:",{"$f":"IF(K2>K3, B2, IF(K3>K2, B3, \"Tie\"))","v":"Flag"},null,"Battle Type","Battle Location and Month (i.e. MD May)","LA Mar",null,null,null,null,"Fleet"]
["Fleet 1 :","Flag",null,"Fleet Units:",34,"Fleet Weight:",57,"Fleet Battle Damage:",10900,"Fleet Score:",12190.0009765625,null,"Battle Day","Sun",null,null,null,null,"Mini-Fleet"]
["Fleet 2 :","No Flag",null,"Fleet Units:",36,"Fleet Weight:",63,"Fleet Battle Damage:",12190,"Fleet Score:",10900,null,"Battle Number",1,null,null,null,null,"Individual"]
["Captian","Ship","Fleet","Class","Units","Above","On","Below","Sinks","Participate all Sorties","Penalties Points","2nd Sortie Sink","Damage Points","Scored By","Notes","Weight Factor","Weight Points","Captian","Captain Points","Indiv Points"]
["Andy Terpstra","Nagato","No Flag",6,6,40,13,22,0,1,0,0,1320,"Andy","None,None,None",10,1730.1587301587301,"Andy Terpstra",1730.1587301587301]
["Bob Hoernemann","Nagato","No Flag",6,6,47,17,45,1,1,0,1,3160,"Bob","None,None,None",10,1730.1587301587301,"Bob Hoernemann",1530.1587301587301]
["Gerald Roberts","Kongo","Flag",4,4.5,51,14,11,1,1,0,1,1920,"Gerald","None,None,None",8,1710.8771929824561,"Gerald Roberts",1510.8771929824561]
["Brandon Smith","Nagato","Flag",6,6,28,4,10,0,1,0,0,660,"Brandon","None,None,None",10,2138.5964912280701,"Brandon Smith",2138.5964912280701]
["Jeff Lide","Yamato","Flag",7,8,143,29,75,1,1,0,1,5460,"Jeff","None,None,None",10,2138.5964912280701,"Jeff Lide",1938.5964912280701]
["John Jones","Gearing","Flag",1,1.5,0,0,0,0,1,0,0,0,"John","None,None,None",4,855.43859649122805,"John Jones",855.43859649122805]
["Johnny Adams","Nagato","Flag",6,6,26,10,14,0,1,0,0,880,"Johhny","None,None,None",10,2138.5964912280701,"Johnny Adams",2138.5964912280701]
["Matt Mullis","Prinz Eugen","No Flag",3,3.5,3,0,0,0,1,0,0,30,"Matt","None,None,None",7,1211.1111111111111,"Matt Mullis",1211.1111111111111]
["Mark Lide","Nagato","No Flag",6,6,44,14,26,2,1,0,1,3500,"Mark","None,None,None",10,1730.1587301587301,"Mark Lide",1530.1587301587301]
["Michael Smith","Seydlitz","No Flag",4,4.5,33,16,12,0,1,0,0,1010,"Mike","None,None,None",8,1384.1269841269841,"Michael Smith",1384.1269841269841]
["Michael Tanzillo","Nagato","No Flag",6,6,33,4,3,0,1,0,0,500,"Mike","None,None,None",10,1730.1587301587301,"Michael Tanzillo",1730.1587301587301]
["Morgan Preston","VDT","No Flag",4,4,66,26,23,1,1,0,1,2670,"Morgan","None,None,None",8,1384.1269841269841,"Morgan Preston",1184.1269841269841]
["Rick Whitsell","Jamaica","Flag",2,2.5,12,7,2,0,1,0,0,320,"Rick","None,None,None",6,1283.1578947368421,"Rick Whitsell",1283.1578947368421]
["Tom Palmer","QE","Flag",5,5.5,54,14,28,0,1,0,0,1660,"Tom","None,None,None",9,1924.7368421052631,"Tom Palmer",1924.7368421052631]

{"sheet":"LA Mar Sat 2","index":44,"n_rows":19,"n_cols":20,"rows_kept":19,"cut":false,"hidden":false,"merged":[]}
[null,null,null,null,null,null,null,null,"Winner:",{"$f":"IF(K2>K3, B2, IF(K3>K2, B3, \"Tie\"))","v":"Flag"},null,"Battle Type","Battle Location and Month (i.e. MD May)","LA Mar",null,null,null,null,"Fleet"]
["Fleet 1 :","Flag",null,"Fleet Units:",38,"Fleet Weight:",65,"Fleet Battle Damage:",9640,"Fleet Score:",15609.9990234375,null,"Battle Day","Sat",null,null,null,null,"Mini-Fleet"]
["Fleet 2 :","No Flag",null,"Fleet Units:",36,"Fleet Weight:",63,"Fleet Battle Damage:",15610,"Fleet Score:",9640,null,"Battle Number",2,null,null,null,null,"Individual"]
["Captian","Ship","Fleet","Class","Units","Above","On","Below","Sinks","Participate all Sorties","Penalties Points","2nd Sortie Sink","Damage Points","Scored By","Notes","Weight Factor","Weight Points","Captian","Captain Points","Indiv Points"]
["Andy Terpstra","Nagato","No Flag",6,6,40,24,25,1,1,0,1,2630,"Andy","None,None,None",10,1530.1587301587301,"Andy Terpstra",1330.1587301587301]
["Bob Hoernemann","Nagato","No Flag",6,6,49,16,49,1,1,0,1,3280,"Bob","None,None,None",10,1530.1587301587301,"Bob Hoernemann",1330.1587301587301]
["Gerald Roberts","Kongo","Flag",4,4.5,48,14,14,0,1,0,0,1180,"Gerald","None,None,None",8,1921.2307692307693,"Gerald Roberts",1921.2307692307693]
["Brandon Smith","Nagato","Flag",6,6,21,1,11,0,1,0,0,560,"Brandon","None,None,None",10,2401.5384615384619,"Brandon Smith",2401.5384615384619]
["Jeff Lide","Yamato","Flag",7,8,87,10,21,0,1,0,0,1700,"Jeff","None,None,None",10,2401.5384615384619,"Jeff Lide",2401.5384615384619]
["John Jones","Gearing","Flag",1,1.5,6,0,1,0,1,0,0,90,"John","None,None,None",4,960.61538461538464,"John Jones",960.61538461538464]
["Johnny Adams","Nagato","Flag",6,6,98,19,25,0,1,0,0,2110,"Johhny","None,None,None",10,2401.5384615384619,"Johnny Adams",2401.5384615384619]
["Michael Smith","Seydlitz","No Flag",4,4.5,33,0,18,0,1,0,0,870,"Ted","None,None,None",8,1224.1269841269841,"Michael Smith",1224.1269841269841]
["Matt Mullis","Prinz Eugen","No Flag",3,3.5,7,0,0,0,1,0,0,70,"Matt","None,None,None",7,1071.1111111111111,"Matt Mullis",1071.1111111111111]
["Mark Lide","Nagato","No Flag",6,6,30,6,22,1,1,0,1,2080,"Mark","None,None,None",10,1530.1587301587301,"Mark Lide",1330.1587301587301]
["Michael Tanzillo","Nagato","No Flag",6,6,103,14,40,2,1,0,1,4510,"Mike","None,None,None",10,1530.1587301587301,"Michael Tanzillo",1330.1587301587301]
["Morgan Preston","VDT","No Flag",4,4,41,12,24,1,1,0,1,2170,"Morgan","None,None,None",8,1224.1269841269841,"Morgan Preston",1024.1269841269841]
["Rick Whitsell","Jamaica","Flag",2,2.5,12,1,3,0,1,0,0,230,"Rick","None,None,None",6,1440.9230769230769,"Rick Whitsell",1440.9230769230769]
["Ted Buehring","VDT","Flag",4,4,7,2,2,0,1,0,0,170,"Ted","None,None,None",8,1921.2307692307693,"Ted Buehring",1921.2307692307693]
["Tom Palmer","QE","Flag",5,5.5,80,11,56,1,1,0,1,3600,"Tom","None,None,None",9,2161.3846153846157,"Tom Palmer",1961.3846153846157]

{"sheet":"LA Mar Sat 1","index":45,"n_rows":19,"n_cols":20,"rows_kept":19,"cut":false,"hidden":false,"merged":[]}
[null,null,null,null,null,null,null,null,"Winner:",{"$f":"IF(K2>K3, B2, IF(K3>K2, B3, \"Tie\"))","v":"No Flag"},null,"Battle Type","Battle Location and Month (i.e. MD May)","LA Mar",null,null,null,null,"Fleet"]
["Fleet 1 :","Flag",null,"Fleet Units:",38,"Fleet Weight:",65,"Fleet Battle Damage:",10920,"Fleet Score:",6840.00048828125,null,"Battle Day","Sat",null,null,null,null,"Mini-Fleet"]
["Fleet 2 :","No Flag",null,"Fleet Units:",36,"Fleet Weight:",63,"Fleet Battle Damage:",6840,"Fleet Score:",10920,null,"Battle Number",1,null,null,null,null,"Individual"]
["Captian","Ship","Fleet","Class","Units","Above","On","Below","Sinks","Participate all Sorties","Penalties Points","2nd Sortie Sink","Damage Points","Scored By","Notes","Weight Factor","Weight Points","Captian","Captain Points","Indiv Points"]
["Andy Terpstra","Nagato","No Flag",6,6,15,7,22,0,1,0,0,950,"Andy","None,None,None",10,1733.3333333333333,"Andy Terpstra",1733.3333333333333]
["Bob Hoernemann","Nagato","No Flag",6,6,41,16,43,0,1,0,0,2020,"Bob","None,None,None",10,1733.3333333333333,"Bob Hoernemann",1733.3333333333333]
["Gerald Roberts","Kongo","Flag",4,4.5,38,14,10,0,1,0,0,960,"Gerald","None,None,None",8,841.84615384615392,"Gerald Roberts",841.84615384615392]
["Brandon Smith","Nagato","Flag",6,6,56,8,24,0,1,0,0,1440,"Brandon","None,None,None",10,1052.3076923076924,"Brandon Smith",1052.3076923076924]
["Jeff Lide","Yamato","Flag",7,8,24,2,9,0,1,0,0,550,"Jeff","None,None,None",10,1052.3076923076924,"Jeff Lide",1052.3076923076924]
["Johnny Adams","Gearing","Flag",1,1.5,4,1,3,0,1,0,0,150,"John","None,None,None",4,420.92307692307696,"Johnny Adams",420.92307692307696]
["Johnny Adams","Nagato","Flag",6,6,94,14,46,1,1,0,1,3600,"John","None,None,None",10,1052.3076923076924,"Johnny Adams",852.30769230769238]
["Matt Mullis","Prinz Eugen","No Flag",3,3.5,3,0,2,0,1,0,0,90,"Matt","None,None,None",7,1213.3333333333333,"Matt Mullis",1213.3333333333333]
["Mark Lide","Nagato","No Flag",6,6,23,11,14,0,1,0,0,870,"Mark","None,None,None",10,1733.3333333333333,"Mark Lide",1733.3333333333333]
["Michael Smith","Seydlitz","No Flag",4,4.5,14,1,4,1,1,0,1,1080,"Mike","None,None,None",8,1386.6666666666665,"Michael Smith",1186.6666666666665]
["Michael Tanzillo","Nagato","No Flag",6,6,21,2,7,0,1,0,0,460,"Mike","None,None,None",10,1733.3333333333333,"Michael Tanzillo",1733.3333333333333]
["Morgan Preston","VDT","No Flag",4,4,19,1,12,1,1,0,1,1370,"Morgan","None,None,None",8,1386.6666666666665,"Morgan Preston",1186.6666666666665]
["Rick Whitsell","Jamaica","Flag",2,2.5,13,0,2,0,1,0,0,190,"Rick","None,None,None",6,631.38461538461547,"Rick Whitsell",631.38461538461547]
["Ted Buehring","VDT","Flag",4,4,7,5,12,1,1,0,1,1330,"Ted","None,None,None",8,841.84615384615392,"Ted Buehring",641.84615384615392]
["Tom Palmer","QE","Flag",5,5.5,44,11,38,1,1,0,1,2700,"Tom","None,None,None",9,947.07692307692309,"Tom Palmer",747.07692307692309]

{"sheet":"MN Sep Sun 3","index":46,"n_rows":13,"n_cols":20,"rows_kept":13,"cut":false,"hidden":false,"merged":[]}
[null,null,null,null,null,null,null,null,"Winner:",{"$f":"IF(K2>K3, B2, IF(K3>K2, B3, \"Tie\"))","v":"No Flag"},null,"Battle Type","Battle Location and Month (i.e. MD May)","MN Sep",null,null,null,null,"Fleet"]
["Fleet 1 :","Flag",null,"Fleet Units:",21.5,"Fleet Weight:",36,"Fleet Battle Damage:",5700,"Fleet Score:",2220,null,"Battle Day","Sun",null,null,null,null,"Mini-Fleet"]
["Fleet 2 :","No Flag",null,"Fleet Units:",18.5,"Fleet Weight:",28,"Fleet Battle Damage:",3020,"Fleet Score:",4700,null,"Battle Number",3,null,null,null,null,"Individual"]
["Captian","Ship","Fleet","Class","Units","Above","On","Below","Sinks","Participate all Sorties","Penalties Points","2nd Sortie Sink","Damage Points","Scored By","Notes","Weight Factor","Weight Points","Captian","Captain Points","Indiv Points"]
["Clint Jackson","Invincible","Flag",4,4,88,9,3,0,1,0,0,1150,"Clint","None,None,None",8,671.11111111111109,"Clint Jackson",671.11111111111109]
["Hudson Maiers","QE","No Flag",5,5.5,48,0,11,0,1,0,0,810,"Hudson","None,None,None",9,1832.1428571428573,"Hudson Maiers",1832.1428571428573]
["Andy Terpstra","QE","Flag",5,5.5,66,2,22,0,1,0,0,1360,"Bob","None,None,None",9,755,"Andy Terpstra",755]
["Tom Palmer","Alaska","No Flag",4,4.5,23,6,23,0,1,0,0,1040,"Tyler","None,None,None",8,1628.5714285714284,"Tom Palmer",1628.5714285714284]
["McCoy Helland","Zara","Flag",3,3,12,1,6,0,1,0,0,320,"Tyler","None,None,None",7,587.22222222222229,"McCoy Helland",587.22222222222229]
["Zach Hoernemann","Kongo","Flag",4,4.5,20,2,25,0,0,800,0,990,"Bob","Withdraw,None,None",4,-464.44444444444446,"Zach Hoernemann",-464.44444444444446]
["Rick Whitsell","Jamaica","No Flag",2,2.5,0,0,0,0,1,0,0,0,"Rick","None,None,None",6,1221.4285714285713,"Rick Whitsell",1221.4285714285713]
["Bob Hoernemann","Nagato","No Flag",6,6,33,12,20,0,0,1000,0,1170,"Bob","Withdraw,None,None",5,17.85714285714289,"Bob Hoernemann",17.85714285714289]
["Peter Ellison","Erin","Flag",4,4.5,41,14,13,1,1,0,1,1880,"Peter","None,None,None",8,671.11111111111109,"Peter Ellison",471.11111111111109]

{"sheet":"MN Sep Sun 2","index":47,"n_rows":17,"n_cols":20,"rows_kept":17,"cut":false,"hidden":false,"merged":[]}
[null,null,null,null,null,null,null,null,"Winner:",{"$f":"IF(K2>K3, B2, IF(K3>K2, B3, \"Tie\"))","v":"No Flag"},null,"Battle Type","Battle Location and Month (i.e. MD May)","MN Sep",null,null,null,null,"Fleet"]
["Fleet 1 :","Flag",null,"Fleet Units:",33.5,"Fleet Weight:",56,"Fleet Battle Damage:",9140,"Fleet Score:",8370,null,"Battle Day","Sun",null,null,null,null,"Mini-Fleet"]
["Fleet 2 :","No Flag",null,"Fleet Units:",28.5,"Fleet Weight:",45.5,"Fleet Battle Damage:",8370,"Fleet Score:",9140,null,"Battle Number",2,null,null,null,null,"Individual"]
["Captian","Ship","Fleet","Class","Units","Above","On","Below","Sinks","Participate all Sorties","Penalties Points","2nd Sortie Sink","Damage Points","Scored By","Notes","Weight Factor","Weight Points","Captian","Captain Points","Indiv Points"]
["Andy Terpstra","QE","Flag",5,5.5,128,9,23,0,1,0,0,2150,"Andy","None,None,None",9,1345.1785714285716,"Andy Terpstra",1345.1785714285716]
["Tom Palmer","Alaska","No Flag",4,4.5,32,15,14,0,1,0,0,1040,"Tom","None,None,None",8,1607.0329670329672,"Tom Palmer",1607.0329670329672]
["Zach Hoernemann","Kongo","Flag",4,4.5,23,5,21,0,1,0,0,960,"Zach","None,None,None",8,1195.7142857142856,"Zach Hoernemann",1195.7142857142856]
["Bob Hoernemann","Nagato","No Flag",6,6,71,16,48,0,1,0,0,2470,"Bob","None,None,None",10,2008.7912087912086,"Bob Hoernemann",2008.7912087912086]
["Michael Smith","NC","Flag",6,6,58,18,24,0,1,0,0,1660,"Mike","None,None,None",10,1494.6428571428571,"Michael Smith",1494.6428571428571]
["Hudson Maiers","QE","No Flag",5,5.5,82,3,14,0,1,0,0,1300,"Hudson","None,None,None",9,1807.9120879120878,"Hudson Maiers",1807.9120879120878]
["Clint Jackson","Invincible","Flag",4,4,51,10,12,0,1,0,0,1070,"Clint","None,None,None",8,1195.7142857142856,"Clint Jackson",1195.7142857142856]
["Peter Ellison","Erin","No Flag",4,4.5,40,13,19,0,1,0,0,1230,"Peter","None,None,None",8,1607.0329670329672,"Peter Ellison",1607.0329670329672]
["Matt Larson","Nagato","Flag",6,6,26,1,2,1,1,0,1,1340,"Matt","None,None,None",10,1494.6428571428571,"Matt Larson",1294.6428571428571]
["Rick Whitsell","Jamaica","No Flag",2,2.5,2,1,1,0,1,0,0,70,"Tyler","None,None,None",6,1205.2747252747254,"Rick Whitsell",1205.2747252747254]
["Tyler Helland","Tiger","Flag",4,4.5,12,2,21,1,0,0,0,1590,"Tyler","None,None,None",4,597.85714285714278,"Tyler Helland",597.85714285714278]
["McCoy Helland","Zara","Flag",3,3,12,2,7,0,1,0,0,370,"Tyler","None,None,None",7,1046.25,"McCoy Helland",1046.25]
["Bryan Box","Idaho","No Flag",5,5.5,68,16,12,1,0,0,0,2260,"Bryan","None,None,None",4.5,903.95604395604391,"Bryan Box",903.95604395604391]

{"sheet":"MN Sep Sun 1","index":48,"n_rows":15,"n_cols":20,"rows_kept":15,"cut":false,"hidden":false,"merged":[]}
[null,null,null,null,null,null,null,null,"Winner:",{"$f":"IF(K2>K3, B2, IF(K3>K2, B3, \"Tie\"))","v":"Flag"},null,"Battle Type","Battle Location and Month (i.e. MD May)","MN Sep",null,null,null,null,"Fleet"]
["Fleet 1 :","Flag",null,"Fleet Units:",22,"Fleet Weight:",41,"Fleet Battle Damage:",7150,"Fleet Score:",7170,null,"Battle Day","Sun",null,null,null,null,"Mini-Fleet"]
["Fleet 2 :","No Flag",null,"Fleet Units:",28.5,"Fleet Weight:",50,"Fleet Battle Damage:",7170,"Fleet Score:",7150,null,"Battle Number",1,null,null,null,null,"Individual"]
["Captian","Ship","Fleet","Class","Units","Above","On","Below","Sinks","Participate all Sorties","Penalties Points","2nd Sortie Sink","Damage Points","Scored By","Notes","Weight Factor","Weight Points","Captian","Captain Points","Indiv Points"]
["Hudson Maiers","QE","No Flag",5,5.5,33,1,7,0,1,0,0,560,"Tyler","None,None,None",9,1287,"Hudson Maiers",1287]
["Clint Jackson","Invincible","Flag",4,4,22,1,1,0,1,0,0,270,"Clint","None,None,None",8,1399.0243902439024,"Clint Jackson",1399.0243902439024]
["Peter Ellison","Erin","No Flag",4,4.5,29,2,13,0,1,0,0,720,"Peter","None,None,None",8,1144,"Peter Ellison",1144]
["Rick Whitsell","Jamaica","No Flag",2,2.5,3,1,1,0,1,0,0,80,"Rick","None,None,None",6,858,"Rick Whitsell",858]
["Bryan Box","Idaho","No Flag",5,5.5,60,4,9,2,1,0,1,2750,"Tyler","None,None,None",9,1287,"Bryan Box",1087]
["Bob Hoernemann","Nagato","No Flag",6,6,50,23,38,0,1,0,0,2100,"Tyler","None,None,None",10,1430,"Bob Hoernemann",1430]
["Zach Hoernemann","Kongo","Flag",4,4.5,35,1,32,0,1,0,0,1330,"Zach","None,None,None",8,1399.0243902439024,"Zach Hoernemann",1399.0243902439024]
["Michael Smith","NC","Flag",6,6,61,12,43,1,1,0,1,3140,"Mike","None,None,None",10,1748.780487804878,"Michael Smith",1548.780487804878]
["Tom Palmer","Alaska","No Flag",4,4.5,33,6,17,0,1,0,0,960,"Tom","None,None,None",8,1144,"Tom Palmer",1144]
["McCoy Helland","Zara","Flag",3,3,13,0,6,0,1,0,0,310,"Hudson","None,None,None",7,1224.1463414634147,"McCoy Helland",1224.1463414634147]
["Tyler Helland","Tiger","Flag",4,4.5,37,6,27,1,1,0,1,2100,"Tyler","None,None,None",8,1399.0243902439024,"Tyler Helland",1199.0243902439024]

{"sheet":"MI May Sun 2","index":49,"n_rows":14,"n_cols":20,"rows_kept":14,"cut":false,"hidden":false,"merged":[]}
[null,null,null,null,null,null,null,null,"Winner:",{"$f":"IF(K2>K3, B2, IF(K3>K2, B3, \"Tie\"))","v":"No Flag"},null,"Battle Type","Battle Location and Month (i.e. MD May)","MI May",null,null,null,null,"Fleet"]
["Fleet 1 :","Flag",null,"Fleet Units:",26,"Fleet Weight:",45,"Fleet Battle Damage:",7480,"Fleet Score:",4950,null,"Battle Day","Sun",null,null,null,null,"Mini-Fleet"]
["Fleet 2 :","No Flag",null,"Fleet Units:",23,"Fleet Weight:",43,"Fleet Battle Damage:",4950,"Fleet Score:",7479.99951171875,null,"Battle Number",2,null,null,null,null,"Individual"]
["Captian","Ship","Fleet","Class","Units","Above","On","Below","Sinks","Participate all Sorties","Penalties Points","2nd Sortie Sink","Damage Points","Scored By","Notes","Weight Factor","Weight Points","Captian","Captain Points","Indiv Points"]
["Bryan Box","Idaho","Flag",5,5.5,50,6,19,3,1,0,1,3890,"Bryan","None,None,None",9,990,"Bryan Box",790]
["Nate Graham","West Virginia","Flag",5,5.5,55,9,6,0,1,0,0,910,"Nate","None,None,None",9,990,"Nate Graham",990]
["Kevin Sundberg","Iron Duke","No Flag",5,5,37,3,6,0,1,0,0,610,"Kevin","None,None,None",9,1565.5813953488373,"Kevin Sundberg",1565.5813953488373]
["William Tustin","Iron Duke","No Flag",5,5,76,14,20,0,1,0,0,1640,"Will","None,None,None",9,1565.5813953488373,"William Tustin",1565.5813953488373]
["Steve Andrews","VDT","No Flag",4,4,84,6,3,1,1,0,1,1850,"Steve","None,None,None",8,1391.6279069767443,"Steve Andrews",1191.6279069767443]
["Craig Singer","Nagato","No Flag",6,6,40,7,6,0,1,0,0,720,"Craig","None,None,None",10,1739.5348837209301,"Craig Singer",1739.5348837209301]
["Kas Gaigalas","Washington","Flag",6,6,29,2,10,0,1,0,0,630,"Craig","None,None,None",10,1100,"Kas Gaigalas",1100]
["Mark Roe","Suffren","Flag",3,3,12,1,1,0,1,0,0,170,"Willl","None,None,None",7,770,"Mark Roe",770]
["Will Cover","South Dakota","Flag",6,6,104,6,24,0,1,0,0,1880,"Mark","None,None,None",10,1100,"Will Cover",1100]
["Evan Fowler","Suffren","No Flag",3,3,11,1,0,0,1,0,0,130,"Evan","None,None,None",7,1217.6744186046512,"Evan Fowler",1217.6744186046512]

{"sheet":"MI May Sun 1","index":50,"n_rows":14,"n_cols":20,"rows_kept":14,"cut":false,"hidden":false,"merged":[]}
[null,null,null,null,null,null,null,null,"Winner:",{"$f":"IF(K2>K3, B2, IF(K3>K2, B3, \"Tie\"))","v":"No Flag"},null,"Battle Type","Battle Location and Month (i.e. MD May)","MI May",null,null,null,null,"Fleet"]
["Fleet 1 :","Flag",null,"Fleet Units:",27,"Fleet Weight:",41,"Fleet Battle Damage:",10380,"Fleet Score:",4760,null,"Battle Day","Sun",null,null,null,null,"Mini-Fleet"]
["Fleet 2 :","No Flag",null,"Fleet Units:",24,"Fleet Weight:",40.5,"Fleet Battle Damage:",4760,"Fleet Score:",10380,null,"Battle Number",1,null,null,null,null,"Individual"]
["Captian","Ship","Fleet","Class","Units","Above","On","Below","Sinks","Participate all Sorties","Penalties Points","2nd Sortie Sink","Damage Points","Scored By","Notes","Weight Factor","Weight Points","Captian","Captain Points","Indiv Points"]
["Will Cover","South Dakota","Flag",6,6,26,0,7,1,0,0,0,1470,"Evan","None,None,None",5,580.48780487804879,"Will Cover",580.48780487804879]
["Kas Gaigalas","Washington","Flag",6,6,35,6,10,0,1,0,0,770,"Evan","None,None,None",10,1160.9756097560976,"Kas Gaigalas",1160.9756097560976]
["Mark Roe","VDT","Flag",4,4,38,9,47,1,1,0,1,2770,"Steve","None,None,None",8,928.78048780487813,"Mark Roe",728.78048780487813]
["Bryan Box","Idaho","Flag",5,5.5,113,12,17,2,1,0,1,3680,"Kevin","None,None,None",9,1044.8780487804879,"Bryan Box",844.87804878048792]
["Kevin Sundberg","Iron Duke","No Flag",5,5,13,1,3,1,1,0,1,1140,"Kevin","None,None,None",9,2306.6666666666665,"Kevin Sundberg",2106.6666666666665]
["Steve Andrews","Iron Duke","No Flag",5,5,39,6,11,0,1,0,0,840,"Steve","None,None,None",9,2306.6666666666665,"Steve Andrews",2306.6666666666665]
["William Tustin","Iron Duke","No Flag",5,5,42,15,13,0,1,0,0,1110,"Will","None,None,None",9,2306.6666666666665,"William Tustin",2306.6666666666665]
["Craig Singer","Nagato","No Flag",6,6,13,3,4,0,1,0,0,310,"Craig","None,None,None",10,2562.962962962963,"Craig Singer",2562.962962962963]
["Nate Graham","West Virginia","Flag",5,5.5,21,2,18,1,1,0,1,1690,"Will","None,None,None",9,1044.8780487804879,"Nate Graham",844.87804878048792]
["Evan Fowler","Suffren","No Flag",3,3,45,3,5,1,0,0,0,1360,"Evan","None,None,None",3.5,897.03703703703695,"Evan Fowler",897.03703703703695]

{"sheet":"MI May Sat 2","index":51,"n_rows":14,"n_cols":20,"rows_kept":14,"cut":false,"hidden":false,"merged":[]}
[null,null,null,null,null,null,null,null,"Winner:",{"$f":"IF(K2>K3, B2, IF(K3>K2, B3, \"Tie\"))","v":"No Flag"},null,"Battle Type","Battle Location and Month (i.e. MD May)","MI May",null,null,null,null,"Fleet"]
["Fleet 1 :","Flag",null,"Fleet Units:",27.5,"Fleet Weight:",47,"Fleet Battle Damage:",5230,"Fleet Score:",3900.000244140625,null,"Battle Day","Sat",null,null,null,null,"Mini-Fleet"]
["Fleet 2 :","No Flag",null,"Fleet Units:",22,"Fleet Weight:",42,"Fleet Battle Damage:",3900,"Fleet Score:",5230,null,"Battle Number",2,null,null,null,null,"Individual"]
["Captian","Ship","Fleet","Class","Units","Above","On","Below","Sinks","Participate all Sorties","Penalties Points","2nd Sortie Sink","Damage Points","Scored By","Notes","Weight Factor","Weight Points","Captian","Captain Points","Indiv Points"]
["Kevin Sundberg","Iron Duke","No Flag",5,5,14,9,5,0,1,0,0,470,"Kevin","None,None,None",9,1120.7142857142856,"Kevin Sundberg",1120.7142857142856]
["Evan Fowler","VDT","No Flag",4,4,9,0,0,2,1,0,1,1690,"Evan","None,None,None",8,996.19047619047615,"Evan Fowler",796.19047619047615]
["Weston Dodge","Suffren","No Flag",3,3,15,6,3,0,1,0,0,360,"Steve","None,None,None",7,871.66666666666663,"Weston Dodge",871.66666666666663]
["Bryan Box","Idaho","Flag",5,5.5,80,5,11,1,1,0,1,2130,"Bryan","None,None,None",9,746.80851063829789,"Bryan Box",546.80851063829789]
["Will Cover","South Dakota","Flag",6,6,71,8,5,0,1,0,0,1020,"Craig","None,None,None",10,829.78723404255322,"Will Cover",829.78723404255322]
["Steve Andrews","Iron Duke","No Flag",5,5,36,8,12,0,1,0,0,880,"Steve","None,None,None",9,1120.7142857142856,"Steve Andrews",1120.7142857142856]
["Craig Singer","Nagato","Flag",6,6,24,5,7,0,1,0,0,550,"Kas","None,None,None",10,829.78723404255322,"Craig Singer",829.78723404255322]
["Kas Gaigalas","Washington","Flag",6,6,31,3,3,0,1,0,0,460,"Will","None,None,None",10,829.78723404255322,"Kas Gaigalas",829.78723404255322]
["Mark Roe","VDT","Flag",4,4,20,9,23,0,1,0,0,1070,"Kevin","None,None,None",8,663.82978723404256,"Mark Roe",663.82978723404256]
["William Tustin","Iron Duke","No Flag",5,5,14,6,8,0,1,0,0,500,"Wil","None,None,None",9,1120.7142857142856,"William Tustin",1120.7142857142856]

{"sheet":"MI May Sat 1","index":52,"n_rows":12,"n_cols":20,"rows_kept":12,"cut":false,"hidden":false,"merged":[]}
[null,null,null,null,null,null,null,null,"Winner:",{"$f":"IF(K2>K3, B2, IF(K3>K2, B3, \"Tie\"))","v":"Flag"},null,"Battle Type","Battle Location and Month (i.e. MD May)","MI May",null,null,null,null,"Fleet"]
["Fleet 1 :","Flag",null,"Fleet Units:",21,"Fleet Weight:",37,"Fleet Battle Damage:",5650,"Fleet Score:",8120,null,"Battle Day","Sat",null,null,null,null,"Mini-Fleet"]
["Fleet 2 :","No Flag",null,"Fleet Units:",21.5,"Fleet Weight:",37,"Fleet Battle Damage:",8120,"Fleet Score:",5650,null,"Battle Number",1,null,null,null,null,"Individual"]
["Captian","Ship","Fleet","Class","Units","Above","On","Below","Sinks","Participate all Sorties","Penalties Points","2nd Sortie Sink","Damage Points","Scored By","Notes","Weight Factor","Weight Points","Captian","Captain Points","Indiv Points"]
["Steve Andrews","Iron Duke","Flag",5,5,14,1,9,0,1,0,0,430,"Steve","None,None,None",9,1975.1351351351352,"Steve Andrews",1975.1351351351352]
["Will Cover","South Dakota","Flag",6,6,72,1,16,1,1,0,1,2220,"Will","None,None,None",10,2194.5945945945946,"Will Cover",1994.5945945945946]
["Kas Gaigalas","Washington","Flag",6,6,19,2,9,0,1,0,0,500,"Will","None,None,None",10,2194.5945945945946,"Kas Gaigalas",2194.5945945945946]
["Mark Roe","VDT","Flag",4,4,30,10,40,1,1,0,1,2500,"Will","None,None,None",8,1755.6756756756758,"Mark Roe",1555.6756756756758]
["Craig Singer","Nagato","No Flag",6,6,105,7,27,0,1,0,0,2000,"Craig","None,None,None",10,1527.0270270270271,"Craig Singer",1527.0270270270271]
["William Tustin","Iron Duke","No Flag",5,5,60,14,21,0,1,0,0,1510,"Will","None,None,None",9,1374.3243243243244,"William Tustin",1374.3243243243244]
["Kevin Sundberg","Iron Duke","No Flag",5,5,24,4,4,1,1,0,1,1340,"Kevin","None,None,None",9,1374.3243243243244,"Kevin Sundberg",1174.3243243243244]
["Bryan Box","Texas","No Flag",5,5.5,43,10,28,2,1,0,1,3270,"Bryan","None,None,None",9,1374.3243243243244,"Bryan Box",1174.3243243243244]

{"sheet":"GA Feb Sun 1","index":53,"n_rows":16,"n_cols":20,"rows_kept":16,"cut":false,"hidden":false,"merged":[]}
[null,null,null,null,null,null,null,null,"Winner:",{"$f":"IF(K2>K3, B2, IF(K3>K2, B3, \"Tie\"))","v":"Axis"},null,"Battle Type","Battle Location and Month (i.e. MD May)","GA Feb",null,null,null,null,"Fleet"]
["Fleet 1 :","Allied",null,"Fleet Units:",27.5,"Fleet Weight:",43,"Fleet Battle Damage:",11350,"Fleet Score:",7390,null,"Battle Day","Sun",null,null,null,null,"Mini-Fleet"]
["Fleet 2 :","Axis",null,"Fleet Units:",24.5,"Fleet Weight:",33.5,"Fleet Battle Damage:",7390,"Fleet Score:",11350.0009765625,null,"Battle Number",1,null,null,null,null,"Individual"]
["Captian","Ship","Fleet","Class","Units","Above","On","Below","Sinks","Participate all Sorties","Penalties Points","2nd Sortie Sink","Damage Points","Scored By","Notes","Weight Factor","Weight Points","Captian","Captain Points","Indiv Points"]
["Kevin Sundberg","Iron Duke","Allied",5,5,61,18,54,0,1,0,0,2590,"Kevin","None,None,None",9,1546.7441860465117,"Kevin Sundberg",1546.7441860465117]
["Kevin Plumer","Courbet","Axis",4,4.5,20,8,37,0,0,0,0,1470,"Kevin","None,None,None",4,1355.2238805970148,"Kevin Plumer",1355.2238805970148]
["Carl Bitondo","Gearing","Allied",1,1.5,7,9,6,1,1,0,1,830,"Carl","None,None,None",4,687.44186046511629,"Carl Bitondo",487.44186046511629]
["Tom Tanner","Ostfriesland","Allied",4,4.5,55,11,30,0,1,0,0,1670,"Tom","None,None,None",8,1374.8837209302326,"Tom Tanner",1374.8837209302326]
["Brian Koehler","QE","Allied",5,5,47,11,30,1,0,0,0,2490,"Brian","None,None,None",4.5,773.37209302325584,"Brian Koehler",773.37209302325584]
["Kevin Plumer","Scharnhorst","Axis",5,5.5,18,1,18,0,0,0,0,740,"Kevin","None,None,None",4.5,1524.6268656716418,"Kevin Plumer",1524.6268656716418]
["William Tustin","Iron Duke","Allied",5,5,37,21,22,1,1,0,1,2350,"Will","None,None,None",9,1546.7441860465117,"William Tustin",1346.7441860465117]
["Caleb Smith","Courbet","Axis",4,4.5,45,5,26,0,1,0,0,1330,"Caleb","None,None,None",8,2710.4477611940297,"Caleb Smith",2710.4477611940297]
["Alex Hampton","Scharnhorst","Axis",5,5.5,98,10,11,2,1,0,1,3310,"Alex","None,None,None",9,3049.2537313432836,"Alex Hampton",2849.2537313432836]
["Steve Andrews","Courbet","Axis",4,4.5,37,1,5,0,1,0,0,540,"Steve","None,None,None",8,2710.4477611940297,"Steve Andrews",2710.4477611940297]
["Matt Andrews","Iron Duke","Allied",5,5,22,1,8,1,0,0,0,1380,"Matt","None,None,None",4.5,773.37209302325584,"Matt Andrews",773.37209302325584]
["John Jones","Gearing","Allied",1,1.5,2,1,0,0,1,0,0,40,"John","None,None,None",4,687.44186046511629,"John Jones",687.44186046511629]

{"sheet":"GA Feb Sat 2","index":54,"n_rows":17,"n_cols":20,"rows_kept":17,"cut":false,"hidden":false,"merged":[]}
[null,null,null,null,null,null,null,null,"Winner:",{"$f":"IF(K2>K3, B2, IF(K3>K2, B3, \"Tie\"))","v":"Axis"},null,"Battle Type","Battle Location and Month (i.e. MD May)","GA Feb",null,null,null,null,"Fleet"]
["Fleet 1 :","Allied",null,"Fleet Units:",29.5,"Fleet Weight:",53.5,"Fleet Battle Damage:",9940,"Fleet Score:",7219.99951171875,null,"Battle Day","Sat",null,null,null,null,"Mini-Fleet"]
["Fleet 2 :","Axis",null,"Fleet Units:",22.5,"Fleet Weight:",40,"Fleet Battle Damage:",7220,"Fleet Score:",9940,null,"Battle Number",2,null,null,null,null,"Individual"]
["Captian","Ship","Fleet","Class","Units","Above","On","Below","Sinks","Participate all Sorties","Penalties Points","2nd Sortie Sink","Damage Points","Scored By","Notes","Weight Factor","Weight Points","Captian","Captain Points","Indiv Points"]
["Caleb Smith","Courbet","Axis",4,4.5,25,4,23,0,1,0,0,1020,"Caleb","None,None,None",8,1988,"Caleb Smith",1988]
["Kevin Plumer","Scharnhorst","Axis",5,5.5,117,10,50,0,1,0,0,2870,"Kevin","None,None,None",9,2236.5,"Kevin Plumer",2236.5]
["Tom Tanner","Ostfriesland","Axis",4,4.5,51,8,6,0,1,0,0,850,"Tom","None,None,None",8,1988,"Tom Tanner",1988]
["Matt Andrews","Iron Duke","Allied",5,5,37,4,23,1,0,0,0,2040,"Matt","None,None,None",4.5,607.28971962616822,"Matt Andrews",607.28971962616822]
["William Tustin","Iron Duke","Allied",5,5,37,9,28,0,1,0,0,1390,"Will","None,None,None",9,1214.5794392523364,"William Tustin",1214.5794392523364]
["Kevin Sundberg","Iron Duke","Allied",5,5,29,12,25,0,1,0,0,1280,"Kevin","None,None,None",9,1214.5794392523364,"Kevin Sundberg",1214.5794392523364]
["Steve Andrews","Iron Duke","Allied",5,5,64,19,64,1,1,0,1,3840,"Steve","None,None,None",9,1214.5794392523364,"Steve Andrews",1014.5794392523364]
["Alex Hampton","Scharnhorst","Axis",5,5.5,43,3,3,2,1,0,1,2380,"Alex","None,None,None",9,2236.5,"Alex Hampton",2036.5]
["Brian Koehler","Ajax","Allied",2,2.5,3,2,2,0,1,0,0,130,"Brian","None,None,None",6,809.71962616822429,"Brian Koehler",809.71962616822429]
["Samuel Durham","Invincible","Allied",4,4,16,5,2,1,1,0,1,1120,"Sam","None,None,None",8,1079.6261682242989,"Samuel Durham",879.62616822429891]
["John Jones","Gearing","Allied",1,1.5,4,0,1,0,1,0,0,70,"John","None,None,None",4,539.81308411214945,"John Jones",539.81308411214945]
["William Tustin","Koln","Axis",2,2.5,4,0,2,0,1,0,0,100,"Will","None,None,None",6,1491,"William Tustin",1491]
["Carl Bitondo","Gearing","Allied",1,1.5,0,2,1,0,1,0,0,70,"carl","None,None,None",4,539.81308411214945,"Carl Bitondo",539.81308411214945]

{"sheet":"GA Feb Sat 1","index":55,"n_rows":16,"n_cols":20,"rows_kept":16,"cut":false,"hidden":false,"merged":[]}
[null,null,null,null,null,null,null,null,"Winner:",{"$f":"IF(K2>K3, B2, IF(K3>K2, B3, \"Tie\"))","v":"Axis"},null,"Battle Type","Battle Location and Month (i.e. MD May)","GA Feb",null,null,null,null,"Fleet"]
["Fleet 1 :","Allied",null,"Fleet Units:",25.5,"Fleet Weight:",48,"Fleet Battle Damage:",11580,"Fleet Score:",4330,null,"Battle Day","Sat",null,null,null,null,"Mini-Fleet"]
["Fleet 2 :","Axis",null,"Fleet Units:",27,"Fleet Weight:",48,"Fleet Battle Damage:",4330,"Fleet Score:",11580,null,"Battle Number",1,null,null,null,null,"Individual"]
["Captian","Ship","Fleet","Class","Units","Above","On","Below","Sinks","Participate all Sorties","Penalties Points","2nd Sortie Sink","Damage Points","Scored By","Notes","Weight Factor","Weight Points","Captian","Captain Points","Indiv Points"]
["Kevin Plumer","Scharnhorst","Axis",5,5.5,6,0,2,0,1,0,0,120,"Kevin","None,None,None",9,2171.25,"Kevin Plumer",2171.25]
["William Brown","Koln","Axis",2,2.5,1,1,1,0,1,0,0,60,"Brian","None,None,None",6,1447.5,"William Brown",1447.5]
["John Jones","Gearing","Allied",1,1.5,3,0,2,0,1,0,0,90,"John","None,None,None",4,360.83333333333331,"John Jones",360.83333333333331]
["Tom Tanner","Ostfriesland","Axis",4,4.5,37,4,2,0,1,0,0,510,"Tom","None,None,None",8,1930,"Tom Tanner",1930]
["William Tustin","Iron Duke","Allied",5,5,53,15,22,1,1,0,1,2390,"Will","None,None,None",9,811.875,"William Tustin",611.875]
["Caleb Smith","Courbet","Axis",4,4.5,35,5,17,0,1,0,0,960,"Caleb","None,None,None",8,1930,"Caleb Smith",1930]
["Matt Andrews","Iron Duke","Allied",5,5,94,18,39,1,1,0,1,3370,"Matt","None,None,None",9,811.875,"Matt Andrews",611.875]
["Steve Andrews","Courbet","Axis",4,4.5,63,1,5,0,1,0,0,800,"Steve","None,None,None",8,1930,"Steve Andrews",1930]
["Brian Koehler","QE","Allied",5,5,43,3,5,1,1,0,1,1540,"Brian","None,None,None",9,811.875,"Brian Koehler",611.875]
["Samuel Durham","Invincible","Allied",4,4,50,5,20,0,1,0,0,1200,"Sam","None,None,None",8,721.66666666666663,"Samuel Durham",721.66666666666663]
["Alex Hampton","Scharnhorst","Axis",5,5.5,65,6,7,1,1,0,1,1880,"Alex","None,None,None",9,2171.25,"Alex Hampton",1971.25]
["Kevin Sundberg","Iron Duke","Allied",5,5,55,17,40,1,1,0,1,2990,"Kevin","None,None,None",9,811.875,"Kevin Sundberg",611.875]

{"sheet":"NC Oct Sun 1","index":56,"n_rows":16,"n_cols":20,"rows_kept":16,"cut":false,"hidden":false,"merged":[]}
[null,null,null,null,null,null,null,null,"Winner:",{"$f":"IF(K2>K3, B2, IF(K3>K2, B3, \"Tie\"))","v":"Axis"},null,"Battle Type","Battle Location and Month (i.e. MD May)","NC Oct",null,null,null,null,"Fleet"]
["Fleet 1 :","Allied",null,"Fleet Units:",28,"Fleet Weight:",44.5,"Fleet Battle Damage:",8230,"Fleet Score:",6809.99951171875,null,"Battle Day","Sun",null,null,null,null,"Mini-Fleet"]
["Fleet 2 :","Axis",null,"Fleet Units:",20.5,"Fleet Weight:",41,"Fleet Battle Damage:",6810,"Fleet Score:",8230,null,"Battle Number",1,null,null,null,null,"Individual"]
["Captian","Ship","Fleet","Class","Units","Above","On","Below","Sinks","Participate all Sorties","Penalties Points","2nd Sortie Sink","Damage Points","Scored By","Notes","Weight Factor","Weight Points","Captian","Captain Points","Indiv Points"]
["Cameron Hunt","Lutzow","Axis",3,3.5,12,2,6,0,1,0,0,340,"Cameron","None,None,None",7,1405.1219512195123,"Cameron Hunt",1405.1219512195123]
["Eric Bitondo","Duetschland","Axis",3,3.5,33,7,20,2,1,0,1,2470,"Eric","None,None,None",7,1405.1219512195123,"Eric Bitondo",1205.1219512195123]
["Carl Bitondo","Duetschland","Axis",3,3.5,64,4,10,1,1,0,1,1720,"Carl","None,None,None",7,1405.1219512195123,"Carl Bitondo",1205.1219512195123]
["Brian Koehler","QE","Allied",5,5.5,15,3,5,1,0,0,0,1260,"Kevin","None,None,None",4.5,688.65168539325839,"Brian Koehler",688.65168539325839]
["Sam Pearson","Radetzky","Allied",3,3.5,61,14,15,1,1,0,1,2040,"Sam","None,None,None",7,1071.2359550561798,"Sam Pearson",871.23595505617982]
["Isaac McKinzie","Capitant","Axis",1,1.5,4,1,0,0,1,0,0,60,"Lee","None,None,None",4,802.92682926829275,"Isaac McKinzie",802.92682926829275]
["Lee McKinzie","Radetzky","Allied",3,3.5,43,16,13,0,1,0,0,1140,"Lee","None,None,None",7,1071.2359550561798,"Lee McKinzie",1071.2359550561798]
["Jeff Lipp","Baden","Allied",5,5.5,23,15,64,0,1,0,0,2450,"Kevin","None,None,None",9,1377.3033707865168,"Jeff Lipp",1377.3033707865168]
["Steve Andrews","Courbet","Allied",4,4.5,27,7,19,0,1,0,0,980,"Steve","None,None,None",8,1224.2696629213483,"Steve Andrews",1224.2696629213483]
["Kevin Plumer","Kongo","Axis",4,4.5,57,8,37,0,1,0,0,1840,"Kevin","None,None,None",8,1605.8536585365855,"Kevin Plumer",1605.8536585365855]
["Brennen Schultz","Nassau","Axis",4,4,8,6,6,0,1,0,0,380,"Brennen","None,None,None",8,1605.8536585365855,"Brennen Schultz",1605.8536585365855]
["Robert Stalnaker","West Virginia","Allied",5,5.5,14,2,6,0,1,0,0,360,"Rob","None,None,None",9,1377.3033707865168,"Robert Stalnaker",1377.3033707865168]

{"sheet":"NC Oct Sat 3","index":57,"n_rows":17,"n_cols":20,"rows_kept":17,"cut":false,"hidden":false,"merged":[]}
[null,null,null,null,null,null,null,null,"Winner:",{"$f":"IF(K2>K3, B2, IF(K3>K2, B3, \"Tie\"))","v":"Allied"},null,"Battle Type","Battle Location and Month (i.e. MD May)","NC Oct",null,null,null,null,"Fleet"]
["Fleet 1 :","Allied",null,"Fleet Units:",25,"Fleet Weight:",44.5,"Fleet Battle Damage:",6020,"Fleet Score:",8290,null,"Battle Day","Sat",null,null,null,null,"Mini-Fleet"]
["Fleet 2 :","Axis",null,"Fleet Units:",20.5,"Fleet Weight:",41,"Fleet Battle Damage:",8290,"Fleet Score:",6020,null,"Battle Number",3,null,null,null,null,"Individual"]
["Captian","Ship","Fleet","Class","Units","Above","On","Below","Sinks","Participate all Sorties","Penalties Points","2nd Sortie Sink","Damage Points","Scored By","Notes","Weight Factor","Weight Points","Captian","Captain Points","Indiv Points"]
["Robert Stalnaker","West Virginia","Allied",5,5.5,59,8,42,1,0,0,0,2910,"Rob","None,None,None",4.5,838.31460674157302,"Robert Stalnaker",838.31460674157302]
["Cameron Hunt","Lutzow","Axis",3,3.5,52,7,5,0,1,0,0,810,"Ron","None,None,None",7,1027.8048780487807,"Cameron Hunt",1027.8048780487807]
["Eric Bitondo","Duetschland","Axis",3,3.5,26,4,11,2,1,0,1,2070,"Eric","None,None,None",7,1027.8048780487807,"Eric Bitondo",827.80487804878067]
["Carl Bitondo","Duetschland","Axis",3,3.5,88,9,21,2,1,0,1,3090,"Carl","None,None,None",7,1027.8048780487807,"Carl Bitondo",827.80487804878067]
["Kevin Plumer","Kongo","Axis",4,4.5,69,10,27,0,1,0,0,1700,"Kevin","None,None,None",8,1174.6341463414635,"Kevin Plumer",1174.6341463414635]
["Steve Andrews","Courbet","Allied",4,4.5,12,11,20,0,1,0,0,940,"Steve","None,None,None",8,1490.3370786516853,"Steve Andrews",1490.3370786516853]
["Isaac McKinzie","Capitant","Axis",1,1.5,4,0,0,0,1,0,0,40,"Jeff","None,None,None",4,587.31707317073176,"Isaac McKinzie",587.31707317073176]
["Lee McKinzie","Radetzky","Allied",3,3.5,30,8,6,0,1,0,0,640,"Jeff","None,None,None",7,1304.0449438202247,"Lee McKinzie",1304.0449438202247]
["Sam Pearson","Radetzky","Allied",3,3.5,37,3,6,0,1,0,0,610,"Sam","None,None,None",7,1304.0449438202247,"Sam Pearson",1304.0449438202247]
["Brennen Schultz","Des Moines","Allied",3,3.5,22,1,3,0,1,0,0,330,"Brennen","None,None,None",7,1304.0449438202247,"Brennen Schultz",1304.0449438202247]
["Rick Schultz","Nassau","Axis",4,4,37,6,3,0,1,0,0,580,"Rick","None,None,None",8,1174.6341463414635,"Rick Schultz",1174.6341463414635]
["Neil Humble","Gearing","Allied",1,1.5,4,0,5,1,1,0,1,590,"Neil","None,None,None",4,745.16853932584263,"Neil Humble",545.16853932584263]
["Brian Koehler","Suffren","Allied",3,3,0,0,0,0,1,0,0,0,"Brian","None,None,None",7,1304.0449438202247,"Brian Koehler",1304.0449438202247]

{"sheet":"NC Oct Sat 2","index":58,"n_rows":19,"n_cols":20,"rows_kept":19,"cut":false,"hidden":false,"merged":[]}
[null,null,null,null,null,null,null,null,"Winner:",{"$f":"IF(K2>K3, B2, IF(K3>K2, B3, \"Tie\"))","v":"Allied"},null,"Battle Type","Battle Location and Month (i.e. MD May)","NC Oct",null,null,null,null,"Fleet"]
["Fleet 1 :","Axis",null,"Fleet Units:",29.5,"Fleet Weight:",57,"Fleet Battle Damage:",8080,"Fleet Score:",4790,null,"Battle Day","Sat",null,null,null,null,"Mini-Fleet"]
["Fleet 2 :","Allied",null,"Fleet Units:",27,"Fleet Weight:",47.5,"Fleet Battle Damage:",4790,"Fleet Score:",7380,null,"Battle Number",2,null,null,null,null,"Individual"]
["Captian","Ship","Fleet","Class","Units","Above","On","Below","Sinks","Participate all Sorties","Penalties Points","2nd Sortie Sink","Damage Points","Scored By","Notes","Weight Factor","Weight Points","Captian","Captain Points","Indiv Points"]
["Rick Schultz","Nassau","Axis",4,4,19,3,2,0,1,0,0,310,"Rick","None,None,None",8,672.28070175438597,"Rick Schultz",672.28070175438597]
["Kevin Plumer","Kongo","Axis",4,4.5,52,7,20,0,1,0,0,1260,"Kevin","None,None,None",8,672.28070175438597,"Kevin Plumer",672.28070175438597]
["Robert Stalnaker","West Virginia","Allied",5,5.5,30,1,9,0,1,0,0,590,"Rob","None,None,None",9,1530.9473684210527,"Robert Stalnaker",1530.9473684210527]
["Neil Humble","Gearing","Allied",1,1.5,0,0,0,0,1,0,0,0,"Neil","None,None,None",4,680.42105263157896,"Neil Humble",680.42105263157896]
["Ginger Andrews","Des Moines","Allied",3,3.5,17,1,2,0,1,0,0,250,"Ginger","None,None,None",7,1190.7368421052631,"Ginger Andrews",1190.7368421052631]
["Brennen Schultz","Suffren","Allied",3,3,5,2,3,0,0,700,0,180,"Brennan","Withdraw,None,None",3.5,-104.63157894736844,"Brennen Schultz",-104.63157894736844]
["Lee McKinzie","Radetzky","Axis",3,3.5,15,7,16,1,1,0,1,1470,"Brennen","None,None,None",7,588.24561403508767,"Lee McKinzie",388.24561403508767]
["Isaac McKinzie","Capitant","Axis",1,1.5,11,0,0,1,1,0,1,510,"Lee","None,None,None",4,336.14035087719299,"Isaac McKinzie",136.14035087719299]
["Carl Bitondo","Duetschland","Axis",3,3.5,39,8,5,0,1,0,0,700,"Carl","None,None,None",7,588.24561403508767,"Carl Bitondo",588.24561403508767]
["Eric Bitondo","Duetschland","Axis",3,3.5,28,1,0,0,1,0,0,300,"Eric","None,None,None",7,588.24561403508767,"Eric Bitondo",588.24561403508767]
["Steve Andrews","Courbet","Allied",4,4.5,38,7,21,1,1,0,1,1950,"Jeff","None,None,None",8,1360.8421052631579,"Steve Andrews",1160.8421052631579]
["Jeff Lipp","Baden","Axis",5,5.5,54,21,50,1,1,0,1,3360,"Steve","None,None,None",9,756.31578947368416,"Jeff Lipp",556.31578947368416]
["Cameron Hunt","Lutzow","Axis",3,3.5,7,2,2,0,1,0,0,170,"Cameron","None,None,None",7,588.24561403508767,"Cameron Hunt",588.24561403508767]
["Sam Pearson","Radetzky","Allied",3,3.5,35,4,9,1,1,0,1,1400,"Sam","None,None,None",7,1190.7368421052631,"Sam Pearson",990.73684210526312]
["Brian Koehler","QE","Allied",5,5.5,19,1,7,0,1,0,0,420,"Brian","None,None,None",9,1530.9473684210527,"Brian Koehler",1530.9473684210527]

{"sheet":"NC Oct Sat 1","index":59,"n_rows":19,"n_cols":20,"rows_kept":19,"cut":false,"hidden":false,"merged":[]}
[null,null,null,null,null,null,null,null,"Winner:",{"$f":"IF(K2>K3, B2, IF(K3>K2, B3, \"Tie\"))","v":"No Flag"},null,"Battle Type","Battle Location and Month (i.e. MD May)","NC Oct",null,null,null,null,"Fleet"]
["Fleet 1 :","Flag",null,"Fleet Units:",30.5,"Fleet Weight:",54.5,"Fleet Battle Damage:",8420,"Fleet Score:",5540,null,"Battle Day","Sat",null,null,null,null,"Mini-Fleet"]
["Fleet 2 :","No Flag",null,"Fleet Units:",26,"Fleet Weight:",48,"Fleet Battle Damage:",5540,"Fleet Score:",8420,null,"Battle Number",1,null,null,null,null,"Individual"]
["Captian","Ship","Fleet","Class","Units","Above","On","Below","Sinks","Participate all Sorties","Penalties Points","2nd Sortie Sink","Damage Points","Scored By","Notes","Weight Factor","Weight Points","Captian","Captain Points","Indiv Points"]
["Jeff Lipp","Baden","No Flag",5,5.5,32,8,10,0,1,0,0,780,"Jeff","None,None,None",9,1578.75,"Jeff Lipp",1578.75]
["Lee McKinzie","Radetzky","Flag",3,3.5,38,10,15,1,1,0,1,1730,"Lee","None,None,None",7,711.55963302752298,"Lee McKinzie",511.55963302752298]
["Isaac McKinzie","Capitant","No Flag",1,1.5,9,1,0,1,0,0,0,510,"Lee","None,None,None",2,350.83333333333331,"Isaac McKinzie",350.83333333333331]
["Eric Bitondo","Duetschland","No Flag",3,3.5,27,2,10,1,1,0,1,1310,"Eric","None,None,None",7,1227.9166666666667,"Eric Bitondo",1027.9166666666667]
["Carl Bitondo","Duetschland","No Flag",3,3.5,40,5,3,0,1,0,0,590,"Carl","None,None,None",7,1227.9166666666667,"Carl Bitondo",1227.9166666666667]
["Cameron Hunt","Lutzow","No Flag",3,3.5,20,2,3,0,1,0,0,330,"Cameron","None,None,None",7,1227.9166666666667,"Cameron Hunt",1227.9166666666667]
["Sam Pearson","Radetzky","Flag",3,3.5,29,3,22,0,1,0,0,1010,"Sam","None,None,None",7,711.55963302752298,"Sam Pearson",711.55963302752298]
["Steve Andrews","Courbet","Flag",4,4.5,22,5,19,0,1,0,0,890,"Jeff","None,None,None",8,813.21100917431193,"Steve Andrews",813.21100917431193]
["Robert Stalnaker","West Virginia","Flag",5,5.5,88,9,28,1,1,0,1,2800,"Rob","None,None,None",9,914.86238532110099,"Robert Stalnaker",714.86238532110099]
["Neil Humble","Gearing","Flag",1,1.5,7,2,1,0,1,0,0,140,"Neil","None,None,None",4,406.60550458715596,"Neil Humble",406.60550458715596]
["Brennen Schultz","Suffren","Flag",3,3,1,1,8,0,0,0,0,270,"Brennan","None,None,None",3.5,355.77981651376149,"Brennen Schultz",355.77981651376149]
["Brian Koehler","QE","Flag",5,5.5,23,2,8,1,1,0,1,1410,"Brian","None,None,None",9,914.86238532110099,"Brian Koehler",714.86238532110099]
["Kevin Plumer","Kongo","No Flag",4,4.5,54,5,32,0,1,0,0,1600,"Kevin","None,None,None",8,1403.3333333333333,"Kevin Plumer",1403.3333333333333]
["Ginger Andrews","Des Moines","Flag",3,3.5,8,0,3,0,1,0,0,170,"Ginger","None,None,None",7,711.55963302752298,"Ginger Andrews",711.55963302752298]
["Rick Schultz","Nassau","No Flag",4,4,17,5,5,0,1,0,0,420,"Rick","None,None,None",8,1403.3333333333333,"Rick Schultz",1403.3333333333333]

{"sheet":"NC Oct Fri 2","index":60,"n_rows":12,"n_cols":20,"rows_kept":12,"cut":false,"hidden":false,"merged":[]}
[null,null,null,null,null,null,null,null,"Winner:",{"$f":"IF(K2>K3, B2, IF(K3>K2, B3, \"Tie\"))","v":"No Flag"},null,"Battle Type","Battle Location and Month (i.e. MD May)","NC Oct",null,null,null,null,"Fleet"]
["Fleet 1 :","Flag",null,"Fleet Units:",16.5,"Fleet Weight:",30,"Fleet Battle Damage:",4020,"Fleet Score:",1509.9998779296875,null,"Battle Day","Fri",null,null,null,null,"Mini-Fleet"]
["Fleet 2 :","No Flag",null,"Fleet Units:",15,"Fleet Weight:",29,"Fleet Battle Damage:",1510,"Fleet Score:",4019.999755859375,null,"Battle Number",2,null,null,null,null,"Individual"]
["Captian","Ship","Fleet","Class","Units","Above","On","Below","Sinks","Participate all Sorties","Penalties Points","2nd Sortie Sink","Damage Points","Scored By","Notes","Weight Factor","Weight Points","Captian","Captain Points","Indiv Points"]
["Steve Andrews","Courbet","No Flag",4,4.5,19,4,10,0,1,0,0,570,"Steve","None,None,None",8,1108.9655172413793,"Steve Andrews",1108.9655172413793]
["Jeff Lipp","Baden","Flag",5,5.5,40,12,24,1,1,0,1,2260,"Jeff","None,None,None",9,453,"Jeff Lipp",253]
["Lee McKinzie","Radetzky","No Flag",3,3.5,18,11,6,0,1,0,0,580,"Lee","None,None,None",7,970.34482758620697,"Lee McKinzie",970.34482758620697]
["Isaac McKinzie","Capitant","Flag",1,1.5,0,0,4,1,1,0,1,520,"Lee","None,None,None",4,201.33333333333334,"Isaac McKinzie",1.3333333333333428]
["Brennen Schultz","Des Moines","No Flag",3,3.5,9,2,1,0,1,0,0,160,"Brennan","None,None,None",7,970.34482758620697,"Brennen Schultz",970.34482758620697]
["Robert Stalnaker","West Virginia","Flag",5,5.5,49,3,12,0,1,0,0,910,"Rob","None,None,None",9,453,"Robert Stalnaker",453]
["Ginger Andrews","Des Moines","No Flag",3,3.5,8,0,4,0,1,0,0,200,"Ginger","None,None,None",7,970.34482758620697,"Ginger Andrews",970.34482758620697]
["Rick Schultz","Nassau","Flag",4,4,20,2,3,0,1,0,0,330,"Rick","None,None,None",8,402.66666666666669,"Rick Schultz",402.66666666666669]

{"sheet":"NC Oct Fri 1","index":61,"n_rows":11,"n_cols":20,"rows_kept":11,"cut":false,"hidden":false,"merged":[]}
[null,null,null,null,null,null,null,null,"Winner:",{"$f":"IF(K2>K3, B2, IF(K3>K2, B3, \"Tie\"))","v":"No Flag"},null,"Battle Type","Battle Location and Month (i.e. MD May)","NC Oct",null,null,null,null,"Fleet"]
["Fleet 1 :","Flag",null,"Fleet Units:",16.5,"Fleet Weight:",30,"Fleet Battle Damage:",1900,"Fleet Score:",850,null,"Battle Day","Fri",null,null,null,null,"Mini-Fleet"]
["Fleet 2 :","No Flag",null,"Fleet Units:",11,"Fleet Weight:",22,"Fleet Battle Damage:",850,"Fleet Score:",1900,null,"Battle Number",1,null,null,null,null,"Individual"]
["Captian","Ship","Fleet","Class","Units","Above","On","Below","Sinks","Participate all Sorties","Penalties Points","2nd Sortie Sink","Damage Points","Scored By","Notes","Weight Factor","Weight Points","Captian","Captain Points","Indiv Points"]
["Isaac McKinzie","Capitant","Flag",1,1.5,6,3,1,0,1,0,0,150,"Ginger","None,None,None",4,113.33333333333333,"Isaac McKinzie",113.33333333333333]
["Rick Schultz","Nassau","Flag",4,4,11,2,6,0,1,0,0,330,"Rick","None,None,None",8,226.66666666666666,"Rick Schultz",226.66666666666666]
["Ginger Andrews","Des Moines","No Flag",3,3.5,14,0,2,0,1,0,0,200,"Rob","None,None,None",7,604.5454545454545,"Ginger Andrews",604.5454545454545]
["Brennen Schultz","Suffren","No Flag",3,3,3,1,0,0,1,0,0,50,"Steve","None,None,None",7,604.5454545454545,"Brennen Schultz",604.5454545454545]
["Steve Andrews","Courbet","No Flag",4,4.5,19,1,13,0,1,0,0,600,"Jeff","None,None,None",8,690.90909090909088,"Steve Andrews",690.90909090909088]
["Jeff Lipp","Baden","Flag",5,5.5,22,6,22,0,1,0,0,1000,"Steve","None,None,None",9,255,"Jeff Lipp",255]
["Robert Stalnaker","West Virginia","Flag",5,5.5,24,0,6,0,1,0,0,420,"Ginger","None,None,None",9,255,"Robert Stalnaker",255]

{"sheet":"PA Sep Sun 1","index":62,"n_rows":18,"n_cols":20,"rows_kept":18,"cut":false,"hidden":false,"merged":[]}
[null,null,null,null,null,null,null,null,"Winner:",{"$f":"IF(K2>K3, B2, IF(K3>K2, B3, \"Tie\"))","v":"Flag"},null,"Battle Type","Battle Location and Month (i.e. MD May)","PA Sep",null,null,null,null,"Fleet"]
["Fleet 1 :","Flag",null,"Fleet Units:",34.5,"Fleet Weight:",63,"Fleet Battle Damage:",9660,"Fleet Score:",10560,null,"Battle Day","Sun",null,null,null,null,"Mini-Fleet"]
["Fleet 2 :","No Flag",null,"Fleet Units:",28,"Fleet Weight:",50,"Fleet Battle Damage:",10560,"Fleet Score:",9660,null,"Battle Number",1,null,null,null,null,"Individual"]
["Captian","Ship","Fleet","Class","Units","Above","On","Below","Sinks","Participate all Sorties","Penalties Points","2nd Sortie Sink","Damage Points","Scored By","Notes","Weight Factor","Weight Points","Captian","Captain Points","Indiv Points"]
["Ken Arena","Iron Duke","Flag",5,5,20,3,14,1,1,0,1,1580,"Ken","None,None,None",9,1508.5714285714284,"Ken Arena",1308.5714285714284]
["Tom Tanner","Ostfriesland","No Flag",4,4.5,42,7,20,0,1,0,0,1160,"Tom","None,None,None",8,1545.6000000000001,"Tom Tanner",1545.6000000000001]
["Kevin Sundberg","Invincible","Flag",4,4,19,11,28,1,1,0,1,2050,"Kevin","None,None,None",8,1340.952380952381,"Kevin Sundberg",1140.952380952381]
["Kevin Plumer","Kongo","No Flag",4,4.5,69,26,79,1,1,0,1,4380,"Kevin","None,None,None",8,1545.6000000000001,"Kevin Plumer",1345.6000000000001]
["Steve Andrews","Courbet","Flag",4,4.5,24,11,31,0,1,0,0,1390,"Steve","None,None,None",8,1340.952380952381,"Steve Andrews",1340.952380952381]
["Matt Andrews","Tromp","Flag",1,1.5,3,0,2,0,1,0,0,90,"Matt","None,None,None",4,670.47619047619048,"Matt Andrews",670.47619047619048]
["Caleb Smith","Courbet","Flag",4,4.5,58,8,22,1,1,0,1,2200,"Caleb","None,None,None",8,1340.952380952381,"Caleb Smith",1140.952380952381]
["William Tustin","Des Moines","Flag",3,3.5,0,4,6,0,1,0,0,260,"Will","None,None,None",7,1173.3333333333333,"William Tustin",1173.3333333333333]
["Kas Gaigalas","Washington","Flag",6,6,37,2,14,0,1,0,0,830,"Kas","None,None,None",10,1676.1904761904761,"Kas Gaigalas",1676.1904761904761]
["Rob Arena","Arizona","Flag",5,5.5,56,8,18,0,1,0,0,1260,"Rob","None,None,None",9,1508.5714285714284,"Rob Arena",1508.5714285714284]
["Craig Singer","Nagato","No Flag",6,6,64,12,42,1,1,0,1,3140,"Craig","None,None,None",10,1932,"Craig Singer",1732]
["Lee McKinzie","Radetzky","No Flag",3,3.5,5,5,7,0,1,0,0,360,"Lee","None,None,None",7,1352.4,"Lee McKinzie",1352.4]
["Nate Graham","West Virginia","No Flag",5,5.5,66,6,5,0,1,0,0,930,"Nate","None,None,None",9,1738.8,"Nate Graham",1738.8]
["Rick Schultz","Nassau","No Flag",4,4,48,1,3,0,1,0,0,590,"Rick","None,None,None",8,1545.6000000000001,"Rick Schultz",1545.6000000000001]

{"sheet":"PA Sep Sat 3","index":63,"n_rows":8,"n_cols":20,"rows_kept":8,"cut":false,"hidden":false,"merged":[]}
[null,null,null,null,null,null,null,null,"Winner:",{"$f":"IF(K2>K3, B2, IF(K3>K2, B3, \"Tie\"))","v":"Flag"},null,"Battle Type","Battle Location and Month (i.e. MD May)","PA Sep",null,null,null,null,"Fleet"]
["Fleet 1 :","Flag",null,"Fleet Units:",3.5,"Fleet Weight:",10,"Fleet Battle Damage:",400,"Fleet Score:",2340,null,"Battle Day","Sat",null,null,null,null,"Mini-Fleet"]
["Fleet 2 :","No Flag",null,"Fleet Units:",3,"Fleet Weight:",8,"Fleet Battle Damage:",2340,"Fleet Score:",400,null,"Battle Number",3,null,null,null,null,"Individual"]
["Captian","Ship","Fleet","Class","Units","Above","On","Below","Sinks","Participate all Sorties","Penalties Points","2nd Sortie Sink","Damage Points","Scored By","Notes","Weight Factor","Weight Points","Captian","Captain Points","Indiv Points"]
["Caleb Smith","Tromp","No Flag",1,1.5,23,4,21,1,1,0,1,1340,"Kevin","None,None,None",4,200,"Caleb Smith",0]
["Kevin Plumer","Roberts","Flag",2,2,14,4,4,0,1,0,0,340,"Kevin","None,None,None",6,1404,"Kevin Plumer",1404]
["Lee McKinzie","Capitani","No Flag",1,1.5,15,3,13,1,1,0,1,1000,"Kevin","None,None,None",4,200,"Lee McKinzie",0]
["Nate Graham","Gearing","Flag",1,1.5,3,0,1,0,1,0,0,60,"Nate","None,None,None",4,936,"Nate Graham",936]

{"sheet":"PA Sep Sat 2","index":64,"n_rows":18,"n_cols":20,"rows_kept":18,"cut":false,"hidden":false,"merged":[]}
[null,null,null,null,null,null,null,null,"Winner:",{"$f":"IF(K2>K3, B2, IF(K3>K2, B3, \"Tie\"))","v":"Flag"},null,"Battle Type","Battle Location and Month (i.e. MD May)","PA Sep",null,null,null,null,"Fleet"]
["Fleet 1 :","Flag",null,"Fleet Units:",29.5,"Fleet Weight:",52,"Fleet Battle Damage:",6150,"Fleet Score:",10630,null,"Battle Day","Sat",null,null,null,null,"Mini-Fleet"]
["Fleet 2 :","No Flag",null,"Fleet Units:",40,"Fleet Weight:",64,"Fleet Battle Damage:",10630,"Fleet Score:",6150,null,"Battle Number",2,null,null,null,null,"Individual"]
["Captian","Ship","Fleet","Class","Units","Above","On","Below","Sinks","Participate all Sorties","Penalties Points","2nd Sortie Sink","Damage Points","Scored By","Notes","Weight Factor","Weight Points","Captian","Captain Points","Indiv Points"]
["Kas Gaigalas","Washington","Flag",6,6,33,0,9,0,1,0,0,600,"Kas","None,None,None",10,2044.2307692307693,"Kas Gaigalas",2044.2307692307693]
["Caleb Smith","Courbet","Flag",4,4.5,78,14,20,1,1,0,1,2460,"Caleb","None,None,None",8,1635.3846153846155,"Caleb Smith",1435.3846153846155]
["Steve Andrews","Courbet","Flag",4,4.5,40,12,20,0,1,0,0,1240,"Steve","None,None,None",8,1635.3846153846155,"Steve Andrews",1635.3846153846155]
["Ken Arena","Iron Duke","Flag",5,5,16,2,6,0,1,0,0,380,"Ken","None,None,None",9,1839.8076923076922,"Ken Arena",1839.8076923076922]
["Kevin Plumer","Kongo","No Flag",4,4.5,46,13,36,1,1,0,1,2600,"Kevin","None,None,None",8,768.75,"Kevin Plumer",568.75]
["Tom Tanner","Ostfriesland","No Flag",4,4.5,49,6,7,0,1,0,0,820,"Tom","None,None,None",8,768.75,"Tom Tanner",768.75]
["Matt Andrews","VV","No Flag",6,6.5,31,6,8,1,0,0,0,1670,"matt","None,None,None",5,480.46875,"Matt Andrews",480.46875]
["Nate Graham","West Virginia","No Flag",5,5.5,60,1,4,0,1,0,0,740,"Rob","None,None,None",9,864.84375,"Nate Graham",864.84375]
["Craig Singer","Nagato","No Flag",6,6,42,7,23,0,1,0,0,1250,"Craig","None,None,None",10,960.9375,"Craig Singer",960.9375]
["Rob Arena","Arizona","Flag",5,5.5,45,12,15,0,1,0,0,1140,"Rob","None,None,None",9,1839.8076923076922,"Rob Arena",1839.8076923076922]
["Lee McKinzie","Radetzky","No Flag",3,3.5,13,2,3,0,1,0,0,260,"Lee","None,None,None",7,672.65625,"Lee McKinzie",672.65625]
["Rick Schultz","Nassau","No Flag",4,4,51,3,2,1,1,0,1,1430,"Rick","None,None,None",8,768.75,"Rick Schultz",568.75]
["Kevin Sundberg","Invincible","Flag",4,4,7,1,8,0,1,0,0,330,"Kevin","None,None,None",8,1635.3846153846155,"Kevin Sundberg",1635.3846153846155]
["Robert Stalnaker","West Virginia","No Flag",5,5.5,34,10,14,1,1,0,1,1860,"Rob","None,None,None",9,864.84375,"Robert Stalnaker",664.84375]

{"sheet":"PA Set Sat 1","index":65,"n_rows":22,"n_cols":20,"rows_kept":22,"cut":false,"hidden":false,"merged":[]}
[null,null,null,null,null,null,null,null,"Winner:",{"$f":"IF(K2>K3, B2, IF(K3>K2, B3, \"Tie\"))","v":"No Flag"},null,"Battle Type","Battle Location and Month (i.e. MD May)","PA Set",null,null,null,null,"Fleet"]
["Fleet 1 :","Flag",null,"Fleet Units:",43.5,"Fleet Weight:",77,"Fleet Battle Damage:",8400,"Fleet Score:",7189.99951171875,null,"Battle Day","Sat",null,null,null,null,"Mini-Fleet"]
["Fleet 2 :","No Flag",null,"Fleet Units:",43.5,"Fleet Weight:",72,"Fleet Battle Damage:",7490,"Fleet Score:",8400,null,"Battle Number",1,null,null,null,null,"Individual"]
["Captian","Ship","Fleet","Class","Units","Above","On","Below","Sinks","Participate all Sorties","Penalties Points","2nd Sortie Sink","Damage Points","Scored By","Notes","Weight Factor","Weight Points","Captian","Captain Points","Indiv Points"]
["Tom Tanner","Ostfriesland","No Flag",4,4.5,55,18,44,1,1,0,1,3030,"Tom","None,None,None",8,933.33333333333326,"Tom Tanner",733.33333333333326]
["Ken Arena","Iron Duke","Flag",5,5,6,0,1,0,1,0,0,90,"Ken","None,None,None",9,875.45454545454538,"Ken Arena",875.45454545454538]
["Lee McKinzie","Radetzky","No Flag",3,3.5,5,5,5,0,1,0,0,300,"Lee","None,None,None",7,816.66666666666663,"Lee McKinzie",816.66666666666663]
["Nate Graham","West Virginia","No Flag",5,5.5,61,2,1,0,1,0,0,680,"Kevin","None,None,None",9,1050,"Nate Graham",1050]
["Caleb Smith","Courbet","Flag",4,4.5,42,11,20,1,1,0,1,2040,"Caleb","None,None,None",8,778.18181818181824,"Caleb Smith",578.18181818181824]
["Craig Singer","Nagato","No Flag",6,6,30,6,25,0,1,0,0,1170,"Craig","None,None,None",10,1166.6666666666667,"Craig Singer",1166.6666666666667]
["Matt Andrews","VV","No Flag",6,6.5,19,6,9,0,1,0,0,580,"Matt A","None,None,None",10,1166.6666666666667,"Matt Andrews",1166.6666666666667]
["William Tustin","Courbet","Flag",4,4.5,4,1,4,0,1,0,0,180,"Will","None,None,None",8,778.18181818181824,"William Tustin",778.18181818181824]
["Steve Andrews","Courbet","Flag",4,4.5,36,9,16,1,1,300,1,1820,"Steve","Ram above VV,Ram below ID,None",8,478.18181818181824,"Steve Andrews",278.18181818181824]
["Rick Schultz","Nassau","No Flag",4,4,37,7,2,0,1,0,0,570,"Rick","None,None,None",8,933.33333333333326,"Rick Schultz",933.33333333333326]
["Kas Gaigalas","Washington","Flag",6,6,24,1,7,0,1,0,0,470,"Kas","None,None,None",10,972.72727272727263,"Kas Gaigalas",972.72727272727263]
["Ginger Andrews","Des Moines","Flag",3,3.5,4,0,4,0,1,0,0,160,"Ginger","None,None,None",7,680.90909090909088,"Ginger Andrews",680.90909090909088]
["Justin Ragucci","Des Moines","No Flag",3,3.5,0,0,0,0,1,0,0,0,"Justin","None,None,None",7,816.66666666666663,"Justin Ragucci",816.66666666666663]
["Kevin Plumer","Kongo","No Flag",4,4.5,42,7,15,0,0,0,0,1010,"Kevin","None,None,None",4,466.66666666666663,"Kevin Plumer",466.66666666666663]
["Rob Arena","Arizona","Flag",5,5.5,24,1,6,0,1,0,0,440,"Rob","None,None,None",9,875.45454545454538,"Rob Arena",875.45454545454538]
["Kevin Sundberg","Invincible","Flag",4,4,36,3,15,0,1,0,0,870,"Kevin","None,None,None",8,778.18181818181824,"Kevin Sundberg",778.18181818181824]
["Robert Stalnaker","West Virginia","No Flag",5,5.5,10,1,1,0,1,0,0,150,"Rob","None,None,None",9,1050,"Robert Stalnaker",1050]
["Will Cover","South Dakota","Flag",6,6,61,3,22,1,1,0,1,2330,"Will","None,None,None",10,972.72727272727263,"Will Cover",772.72727272727263]

{"sheet":"PA Sep Fri 1","index":66,"n_rows":13,"n_cols":20,"rows_kept":13,"cut":false,"hidden":false,"merged":[]}
[null,null,null,null,null,null,null,null,"Winner:",{"$f":"IF(K2>K3, B2, IF(K3>K2, B3, \"Tie\"))","v":"No Flag"},null,"Battle Type","Battle Location and Month (i.e. MD May)","PA Sep",null,null,null,null,"Fleet"]
["Fleet 1 :","Flag",null,"Fleet Units:",19.5,"Fleet Weight:",34,"Fleet Battle Damage:",4570,"Fleet Score:",3060,null,"Battle Day","Fri",null,null,null,null,"Mini-Fleet"]
["Fleet 2 :","No Flag",null,"Fleet Units:",21.5,"Fleet Weight:",40,"Fleet Battle Damage:",3260,"Fleet Score:",4570,null,"Battle Number",1,null,null,null,null,"Individual"]
["Captian","Ship","Fleet","Class","Units","Above","On","Below","Sinks","Participate all Sorties","Penalties Points","2nd Sortie Sink","Damage Points","Scored By","Notes","Weight Factor","Weight Points","Captian","Captain Points","Indiv Points"]
["Steve Andrews","Courbet","Flag",4,4.5,22,4,10,0,1,0,0,600,"Steve","None,None,None",8,767.05882352941171,"Steve Andrews",767.05882352941171]
["Craig Singer","Nagato","No Flag",6,6,57,8,35,0,1,0,0,1780,"Craig","None,None,None",10,1142.5,"Craig Singer",1142.5]
["Kevin Sundberg","Invincible","No Flag",4,4,9,2,4,0,1,0,0,250,"Kevin","None,None,None",8,914,"Kevin Sundberg",914]
["Rick Schultz","Nassau","No Flag",4,4,33,4,12,0,1,0,0,770,"Rick","None,None,None",8,914,"Rick Schultz",914]
["Nate Graham","Gearing","No Flag",1,1.5,0,0,0,0,1,0,0,0,"Nate","None,None,None",4,457,"Nate Graham",457]
["Caleb Smith","Courbet","Flag",4,4.5,78,3,3,0,1,0,0,930,"Caleb","None,None,None",8,767.05882352941171,"Caleb Smith",767.05882352941171]
["William Tustin","Courbet","Flag",4,4.5,65,6,1,0,1,200,0,800,"Will","Ram Below,None,None",8,567.05882352941171,"William Tustin",567.05882352941171]
["Kas Gaigalas","Washington","No Flag",6,6,31,0,5,0,1,0,0,460,"Will","None,None,None",10,1142.5,"Kas Gaigalas",1142.5]
["Will Cover","South Dakota","Flag",6,6,48,2,24,1,1,0,1,2240,"Will","None,None,None",10,958.82352941176475,"Will Cover",758.82352941176475]

{"sheet":"MI Oct Sat 3","index":67,"n_rows":7,"n_cols":20,"rows_kept":7,"cut":false,"hidden":false,"merged":[]}
[null,null,null,null,null,null,null,null,"Winner:",{"$f":"IF(K2>K3, B2, IF(K3>K2, B3, \"Tie\"))","v":"Allied"},null,"Battle Type","Battle Location and Month (i.e. MD May)","MI Oct",null,null,null,null,"Fleet"]
["Fleet 1 :","Allied",null,"Fleet Units:",6,"Fleet Weight:",10,"Fleet Battle Damage:",660,"Fleet Score:",3080,null,"Battle Day","Sat",null,null,null,null,"Mini-Fleet"]
["Fleet 2 :","Axis",null,"Fleet Units:",11.5,"Fleet Weight:",19,"Fleet Battle Damage:",3080,"Fleet Score:",460,null,"Battle Number",3,null,null,null,null,"Individual"]
["Captian","Ship","Fleet","Class","Units","Above","On","Below","Sinks","Participate all Sorties","Penalties Points","2nd Sortie Sink","Damage Points","Scored By","Notes","Weight Factor","Weight Points","Captian","Captain Points","Indiv Points"]
["Kas Gaigalas","Washington","Allied",6,6,36,3,8,0,1,0,0,660,"Craig","None,None,None",10,3080,"Kas Gaigalas",3080]
["Craig Singer","Nagato","Axis",6,6,13,2,8,0,1,0,0,410,"Kas","None,None,None",10,347.36842105263156,"Craig Singer",347.36842105263156]
["Mark Roe","Baden","Axis",5,5.5,43,7,40,1,1,200,1,2670,"Kas","Ram Below,None,None",9,112.63157894736838,"Mark Roe",-87.368421052631618]

{"sheet":"MI Oct Sat 2","index":68,"n_rows":7,"n_cols":20,"rows_kept":7,"cut":false,"hidden":false,"merged":[]}
[null,null,null,null,null,null,null,null,"Winner:",{"$f":"IF(K2>K3, B2, IF(K3>K2, B3, \"Tie\"))","v":"Allied"},null,"Battle Type","Battle Location and Month (i.e. MD May)","MI Oct",null,null,null,null,"Fleet"]
["Fleet 1 :","Allied",null,"Fleet Units:",6,"Fleet Weight:",10,"Fleet Battle Damage:",790,"Fleet Score:",3020,null,"Battle Day","Sat",null,null,null,null,"Mini-Fleet"]
["Fleet 2 :","Axis",null,"Fleet Units:",11.5,"Fleet Weight:",19,"Fleet Battle Damage:",3020,"Fleet Score:",790,null,"Battle Number",2,null,null,null,null,"Individual"]
["Captian","Ship","Fleet","Class","Units","Above","On","Below","Sinks","Participate all Sorties","Penalties Points","2nd Sortie Sink","Damage Points","Scored By","Notes","Weight Factor","Weight Points","Captian","Captain Points","Indiv Points"]
["Kas Gaigalas","Washington","Allied",6,6,33,8,10,0,1,0,0,790,"Craig","None,None,None",10,3020,"Kas Gaigalas",3020]
["Craig Singer","Nagato","Axis",6,6,33,8,25,0,1,0,0,1240,"Kas","None,None,None",10,415.78947368421052,"Craig Singer",415.78947368421052]
["Mark Roe","Baden","Axis",5,5.5,45,11,37,0,1,0,0,1780,"Kas","None,None,None",9,374.21052631578948,"Mark Roe",374.21052631578948]

{"sheet":"MI Oct Sat 1","index":69,"n_rows":7,"n_cols":20,"rows_kept":7,"cut":false,"hidden":false,"merged":[]}
[null,null,null,null,null,null,null,null,"Winner:",{"$f":"IF(K2>K3, B2, IF(K3>K2, B3, \"Tie\"))","v":"Allied"},null,"Battle Type","Battle Location and Month (i.e. MD May)","MI Oct",null,null,null,null,"Fleet"]
["Fleet 1 :","Allied",null,"Fleet Units:",6,"Fleet Weight:",10,"Fleet Battle Damage:",320,"Fleet Score:",3320,null,"Battle Day","Sat",null,null,null,null,"Mini-Fleet"]
["Fleet 2 :","Axis",null,"Fleet Units:",11.5,"Fleet Weight:",19,"Fleet Battle Damage:",3320,"Fleet Score:",320,null,"Battle Number",1,null,null,null,null,"Individual"]
["Captian","Ship","Fleet","Class","Units","Above","On","Below","Sinks","Participate all Sorties","Penalties Points","2nd Sortie Sink","Damage Points","Scored By","Notes","Weight Factor","Weight Points","Captian","Captain Points","Indiv Points"]
["Kas Gaigalas","Washington","Allied",6,6,18,1,4,0,1,0,0,320,"Mark","None,None,None",10,3320,"Kas Gaigalas",3320]
["Mark Roe","Baden","Axis",5,5.5,31,8,17,1,1,0,1,1880,"Kas","None,None,None",9,151.57894736842104,"Mark Roe",-48.421052631578959]
["Craig Singer","Nagato","Axis",6,6,21,1,7,1,1,0,1,1440,"Kas","None,None,None",10,168.42105263157893,"Craig Singer",-31.578947368421069]

{"sheet":"MI Sep Sat 3","index":70,"n_rows":6,"n_cols":20,"rows_kept":6,"cut":false,"hidden":false,"merged":[]}
[null,null,null,null,null,null,null,null,"Winner:",{"$f":"IF(K2>K3, B2, IF(K3>K2, B3, \"Tie\"))","v":"Allied"},null,"Battle Type","Battle Location and Month (i.e. MD May)","MI Sep",null,null,null,null,"Fleet"]
["Fleet 1 :","Allied",null,"Fleet Units:",6,"Fleet Weight:",10,"Fleet Battle Damage:",570,"Fleet Score:",2530,null,"Battle Day","Sat",null,null,null,null,"Mini-Fleet"]
["Fleet 2 :","Axis",null,"Fleet Units:",6,"Fleet Weight:",10,"Fleet Battle Damage:",2530,"Fleet Score:",570,null,"Battle Number",3,null,null,null,null,"Individual"]
["Captian","Ship","Fleet","Class","Units","Above","On","Below","Sinks","Participate all Sorties","Penalties Points","2nd Sortie Sink","Damage Points","Scored By","Notes","Weight Factor","Weight Points","Captian","Captain Points","Indiv Points"]
["Will Cover","South Dakota","Axis",6,6,52,4,31,1,1,0,1,2530,"Kas","None,None,None",10,570,"Will Cover",370,0]
["Kas Gaigalas","Washington","Allied",6,6,33,0,8,0,1,0,0,570,"Will","None,None,None",10,2530,"Kas Gaigalas",2530,1960]

{"sheet":"MI Sep Sat 2","index":71,"n_rows":7,"n_cols":20,"rows_kept":7,"cut":false,"hidden":false,"merged":[]}
[null,null,null,null,null,null,null,null,"Winner:",{"$f":"IF(K2>K3, B2, IF(K3>K2, B3, \"Tie\"))","v":"Allied"},null,"Battle Type","Battle Location and Month (i.e. MD May)","MI Sep",null,null,null,null,"Fleet"]
["Fleet 1 :","Allied",null,"Fleet Units:",6,"Fleet Weight:",10,"Fleet Battle Damage:",490,"Fleet Score:",2620,null,"Battle Day","Sat",null,null,null,null,"Mini-Fleet"]
["Fleet 2 :","Axis",null,"Fleet Units:",11.5,"Fleet Weight:",19,"Fleet Battle Damage:",2620,"Fleet Score:",-410,null,"Battle Number",2,null,null,null,null,"Individual"]
["Captian","Ship","Fleet","Class","Units","Above","On","Below","Sinks","Participate all Sorties","Penalties Points","2nd Sortie Sink","Damage Points","Scored By","Notes","Weight Factor","Weight Points","Captian","Captain Points","Indiv Points"]
["Mark Roe","Baden","Axis",5,5.5,43,4,26,0,1,0,0,1290,"Kas","None,None,None",9,232.10526315789471,"Mark Roe",232.10526315789471]
["Craig Singer","Nagato","Axis",6,6,38,7,27,0,1,900,0,1330,"Kas","Ram Sink Baden,None,None",10,-642.1052631578948,"Craig Singer",-642.1052631578948]
["Kas Gaigalas","Washington","Allied",6,6,32,1,5,0,1,0,0,490,"Mark","None,None,None",10,2620,"Kas Gaigalas",2620]

{"sheet":"MI Sep Sat 1","index":72,"n_rows":7,"n_cols":20,"rows_kept":7,"cut":false,"hidden":false,"merged":[]}
[null,null,null,null,null,null,null,null,"Winner:",{"$f":"IF(K2>K3, B2, IF(K3>K2, B3, \"Tie\"))","v":"Allied"},null,"Battle Type","Battle Location and Month (i.e. MD May)","MI Sep",null,null,null,null,"Fleet"]
["Fleet 1 :","Allied",null,"Fleet Units:",6,"Fleet Weight:",10,"Fleet Battle Damage:",770,"Fleet Score:",2490,null,"Battle Day","Sat",null,null,null,null,"Mini-Fleet"]
["Fleet 2 :","Axis",null,"Fleet Units:",11.5,"Fleet Weight:",19,"Fleet Battle Damage:",2490,"Fleet Score:",570,null,"Battle Number",1,null,null,null,null,"Individual"]
["Captian","Ship","Fleet","Class","Units","Above","On","Below","Sinks","Participate all Sorties","Penalties Points","2nd Sortie Sink","Damage Points","Scored By","Notes","Weight Factor","Weight Points","Captian","Captain Points","Indiv Points"]
["Mark Roe","Baden","Axis",5,5.5,48,11,20,1,1,0,1,2200,"Kas","None,None,None",9,364.73684210526312,"Mark Roe",164.73684210526312]
["Craig Singer","Nagato","Axis",6,6,11,0,6,0,1,200,0,290,"Kas","Ram Below,None,None",10,205.26315789473682,"Craig Singer",205.26315789473682]
["Kas Gaigalas","Washington","Allied",6,6,37,2,12,0,1,0,0,770,"Craig","None,None,None",10,2490,"Kas Gaigalas",2490]

{"sheet":"MI Aug Sat 1","index":73,"n_rows":7,"n_cols":20,"rows_kept":7,"cut":false,"hidden":false,"merged":[]}
[null,null,null,null,null,null,null,null,"Winner:",{"$f":"IF(K2>K3, B2, IF(K3>K2, B3, \"Tie\"))","v":"Allied"},null,"Battle Type","Battle Location and Month (i.e. MD May)","MI Aug",null,null,null,null,"Fleet"]
["Fleet 1 :","Allied",null,"Fleet Units:",6,"Fleet Weight:",10,"Fleet Battle Damage:",390,"Fleet Score:",2680,null,"Battle Day","Sat",null,null,null,null,"Mini-Fleet"]
["Fleet 2 :","Axis",null,"Fleet Units:",9.5,"Fleet Weight:",17,"Fleet Battle Damage:",2680,"Fleet Score:",390,null,"Battle Number",1,null,null,null,null,"Individual"]
["Captian","Ship","Fleet","Class","Units","Above","On","Below","Sinks","Participate all Sorties","Penalties Points","2nd Sortie Sink","Damage Points","Scored By","Notes","Weight Factor","Weight Points","Captian","Captain Points","Indiv Points"]
["Craig Singer","Invincible","Axis",4,4,52,3,14,1,1,0,1,1800,"Kas","None,None,None",8,183.52941176470588,"Craig Singer",-16.470588235294116]
["Mark Roe","Baden","Axis",5,5.5,19,9,17,0,1,0,0,880,"Kas","None,None,None",9,206.47058823529412,"Mark Roe",206.47058823529412]
["Kas Gaigalas","Washington","Allied",6,6,16,1,7,0,1,0,0,390,"Craig","None,None,None",10,2680,"Kas Gaigalas",2680]

{"sheet":"MI Jul 1 1","index":74,"n_rows":6,"n_cols":20,"rows_kept":6,"cut":false,"hidden":false,"merged":[]}
[null,null,null,null,null,null,null,null,"Winner:",{"$f":"IF(K2>K3, B2, IF(K3>K2, B3, \"Tie\"))","v":"Allied"},null,"Battle Type","Battle Location and Month (i.e. MD May)","MI Jul",null,null,null,null,"Fleet"]
["Fleet 1 :","Allied",null,"Fleet Units:",6,"Fleet Weight:",10,"Fleet Battle Damage:",360,"Fleet Score:",1060,null,"Battle Day",1,null,null,null,null,"Mini-Fleet"]
["Fleet 2 :","Axis",null,"Fleet Units:",5.5,"Fleet Weight:",9,"Fleet Battle Damage:",1060,"Fleet Score:",360,null,"Battle Number",1,null,null,null,null,"Individual"]
["Captian","Ship","Fleet","Class","Units","Above","On","Below","Sinks","Participate all Sorties","Penalties Points","2nd Sortie Sink","Damage Points","Scored By","Notes","Weight Factor","Weight Points","Captian","Captain Points","Indiv Points"]
["Mark Roe","Baden","Axis",5,5.5,54,8,12,0,1,0,0,1060,"Kas","None,None,None",9,360,"Mark Roe",360,0]
["Kas Gaigalas","Washington","Allied",6,6,21,0,5,0,1,0,0,360,"Mark","None,None,None",10,1060,"Kas Gaigalas",1060,700]

{"sheet":"Instructions","index":75,"n_rows":13,"n_cols":2,"rows_kept":13,"cut":false,"hidden":false,"merged":[[8,1,8,11],[10,0,10,10],[12,0,12,6],[1,0,1,12],[3,0,3,15],[5,0,5,7],[7,0,7,12]]}
[]
["Ensure that all participating captains/ships are entered into the Captian Tab."]
[]
["Make a COPY of the \"Master Score Sheet\" tab and rename it to the name of the battle to be scored."]
[]
["Enter Opposing Fleet Names into Cells B2 & B3"]
[]
["Use the \"Enter Score\" button to enter the socres for ALL battlers in the battle."]
[null,"DO NOT CLOSE THE WINDOW UNTIL ALL SCORES ARE ENTERED"]
[]
["Use the \"Calculate Totals\" button to finish the scoring of the battle"]
[]
["The Winner will be displayed in Cell J1"]